program: Orca
programVersion: 5.0.2
elementType: O O O N C C C C C C C C C C C C C C C C C C C C C C C C H H H H H H H H H H H H H H H H H H H H H H H H H
charge: 0
multiplicity: 1
keywords: wb97x-d3
keywords: def2-TZVPP
keywords: def2/J RIJCOSX
keywords: DEFGRID2
keywords: scfconv7
keywords: smallprint printgap noloewdin
keywords: NOSOSCF
formula: C24H25NO3
InChI: InChI=1/C24H25NO3/c1-16(2)13-20-22(24(20,3)4)23(26)28-21(15-25)17-9-8-12-19(14-17)27-18-10-6-5-7-11-18/h5-14,20-22H,1-4H3
53 atoms
O  -1.337235 2.034515 0.037653
O  0.365043 0.815017 0.803291
O  -0.920951 -3.688948 -0.881824
N  -2.287583 0.263864 2.79368
C  1.740653 3.662629 0.879451
C  2.267207 2.854806 -0.265907
C  0.767145 3.004215 -0.087694
C  1.911009 3.120506 2.277014
C  1.794298 5.170099 0.822422
C  2.909601 3.463371 -1.446585
C  -0.032489 1.836357 0.303679
C  4.034998 3.053333 -2.041189
C  4.863456 1.884338 -1.602339
C  4.565276 3.771718 -3.246059
C  -2.227967 0.952569 0.272076
C  -2.014835 -0.196473 -0.688654
C  -2.218472 0.554903 1.684692
C  -1.563543 -1.440601 -0.269605
C  -2.275837 0.043092 -2.032694
C  -1.388078 -2.452641 -1.205778
C  -2.07836 -0.971158 -2.957108
C  -1.641698 -2.221132 -2.551922
C  -1.003287 -4.13504 0.414277
C  0.174323 -4.436467 1.078996
C  -2.237234 -4.328977 1.02069
C  0.114127 -4.95124 2.367328
C  -2.283193 -4.834691 2.311269
C  -1.110954 -5.148328 2.987902
H  2.644378 1.880245 0.024484
H  0.264081 3.688027 -0.762526
H  1.08402 3.426698 2.921207
H  1.982565 2.035582 2.313827
H  2.82911 3.520333 2.711942
H  1.578346 5.568246 -0.168105
H  1.067975 5.602238 1.513554
H  2.783173 5.528475 1.115629
H  2.406806 4.328418 -1.869071
H  5.890699 2.199087 -1.400387
H  4.492254 1.388105 -0.708088
H  4.923203 1.135409 -2.396579
H  3.931637 4.607817 -3.542568
H  5.570526 4.160384 -3.062055
H  4.649225 3.094726 -4.100652
H  -3.216683 1.381874 0.090255
H  -1.344315 -1.620767 0.775099
H  -2.634109 1.011587 -2.358712
H  -2.279288 -0.791502 -4.005082
H  -1.496675 -3.016397 -3.272257
H  1.127497 -4.275908 0.590892
H  -3.152126 -4.094176 0.49032
H  1.032191 -5.193314 2.887016
H  -3.242797 -4.988349 2.78778
H  -1.153917 -5.545801 3.993397
elementType: O N C H
totalener: -1210.10590166 hartree
nucrepener: 2477.94024078 hartree
electener: -3688.04614243 hartree
oneelecener: -6568.45775020 hartree
twoeener: 2880.41160777 hartree
cpcmener: -0.03244616 hartree
kineticenergy: 1204.71554373 hartree
xcener: -118.586663482695 hartree
chargesum: -0.0000000
charge: -0.286086 -0.449225 -0.325914 -0.081895 0.102524 0.044010 -0.116470 -0.271781 -0.269833 -0.277533 0.428723 -0.047628 -0.251779 -0.218026 0.470149 -0.055445 -0.251730 -0.127844 -0.259779 0.256228 -0.108997 -0.239294 0.242778 -0.208652 -0.175534 -0.140131 -0.149082 -0.162088 0.093770 0.087549 0.098562 0.093733 0.096481 0.088613 0.097999 0.098473 0.116771 0.094867 0.090668 0.096581 0.087554 0.093559 0.092903 0.146107 0.128971 0.142966 0.157660 0.147092 0.147454 0.156568 0.158080 0.158712 0.158640
qa: -0.2861 -0.4492 -0.3259 -0.0819 0.1025 0.0440 -0.1165 -0.2718 -0.2698 -0.2775 0.4287 -0.0476 -0.2518 -0.2180 0.4701 -0.0554 -0.2517 -0.1278 -0.2598 0.2562 -0.1090 -0.2393 0.2428 -0.2087 -0.1755 -0.1401 -0.1491 -0.1621 0.0938 0.0875 0.0986 0.0937 0.0965 0.0886 0.0980 0.0985 0.1168 0.0949 0.0907 0.0966 0.0876 0.0936 0.0929 0.1461 0.1290 0.1430 0.1577 0.1471 0.1475 0.1566 0.1581 0.1587 0.1586
va: 2.1311 2.0619 2.0846 3.1062 3.7002 3.7729 3.8660 3.9083 3.9079 3.8762 4.1417 3.7670 3.9413 3.9216 3.8346 3.7180 4.0752 3.8447 3.9943 3.8075 3.9034 4.0100 3.7273 3.9978 3.9373 3.8915 3.8938 3.8911 1.0314 1.0370 1.0001 1.0179 1.0001 1.0063 1.0018 1.0017 1.0116 0.9974 1.0103 0.9966 1.0091 0.9964 0.9961 0.9914 1.0271 1.0073 0.9891 1.0067 1.0055 0.9966 0.9898 0.9902 0.9900
dispcorr: -0.024990512 hartree
energy: -1210.130892168999
dipole: 27.57870 -27.48316 0.09554 23.81433 -22.56920 1.24514 -5.66061 3.94463 -1.71597
magnitude: 2.12227 au
magnitude: 5.39439 debye
