program: Gaussian 09
title: 000072432
version: EM64L-G09RevD.01
frameworkgroup: C1[X(C12H22O10S)]
method: RPBEPBE
basis: SDD
operation: Freq
keyword: #p
keyword: freq=noraman
keyword: PBEPBE/SDD
title: #p freq=noraman PBEPBE/SDD
converged: NO YES NO NO
title: Mulliken charges:
elementType: S O O O O O O O O O O C C C C C C C C C C C C H H H H H H H H H H H H H H H H H H H H H H
charge: 0.125423 -0.241474 -0.233517 -0.439738 -0.458749 -0.475615 -0.459053 -0.452986 -0.409581 -0.484527 -0.434512 -0.478627 -0.081967 -0.395839 -0.161605 -0.195629 -0.149099 -0.091604 -0.113239 -0.043810 -0.056709 -0.368164 -0.364450 0.319893 0.260718 0.299702 0.264048 0.265532 0.255670 0.218379 0.264488 0.265060 0.224093 0.234731 0.205353 0.190685 0.255390 0.363837 0.377860 0.369874 0.369423 0.368257 0.366432 0.378595 0.347050
chargesum: 0.00000
title: Mulliken charges with hydrogens summed into heavy atoms:
elementType: S O O O O O O O O O O C C C C C C C C C C C C
charge: 0.125423 -0.241474 -0.233517 -0.075901 -0.080890 -0.105741 -0.089630 -0.084729 -0.043149 -0.105931 -0.087462 -0.158734 0.178752 -0.096137 0.102443 0.069903 0.106571 0.126775 0.151250 0.221250 0.167384 0.071919 0.081625
polarizability: 2.20580202e+02 5.76720297e+00 1.80962487e+02 3.85475692e+00 -1.72219834e+00 1.46596444e+02
1716.lowfreq: -5.5390 0.0007 0.0012 0.0017 4.0938 13.7170 33.3013 34.9883 44.4906
frequency: 30.0472 34.5887 44.1470 67.7137 86.1955 88.8870 101.5654 109.2715 114.8812 135.4934 152.3315 161.4100 177.2963 193.6722 204.6535 215.8433 220.4187 242.4476 247.4118 263.3958 292.4334 300.0209 311.6504 328.3975 343.0621 348.6081 356.1557 382.7719 384.8149 395.9910 406.0593 420.7612 429.9193 441.0404 470.6305 492.4353 508.3511 511.1483 532.6764 550.6098 556.3456 559.4993 563.6194 586.1325 602.2689 660.3901 724.5466 744.8333 775.4832 795.9712 804.1111 826.6885 878.0701 938.3376 950.4857 953.4106 958.1512 964.9524 971.4471 988.2982 993.3812 1009.2704 1018.0959 1019.7911 1028.5390 1038.4890 1047.0624 1062.4664 1066.8906 1074.5296 1086.4436 1110.7905 1139.3648 1159.2961 1171.8728 1182.1497 1185.1426 1192.5908 1205.8604 1215.0676 1221.6471 1226.0659 1270.4398 1276.5734 1280.4145 1285.8789 1293.4468 1296.0700 1303.3303 1311.9197 1313.5314 1316.0969 1327.4874 1335.4831 1340.8575 1346.6628 1363.5662 1369.9261 1377.7363 1378.8483 1380.7347 1390.9396 1394.3919 1398.8774 1419.3107 1462.9466 1466.6654 2954.5878 2963.4985 2972.7870 2992.9879 2994.6951 3016.2664 3017.6631 3027.1639 3037.7621 3056.5072 3068.3928 3072.9443 3084.4160 3110.2219 3424.6114 3441.4866 3515.0146 3549.2454 3550.5070 3563.3623 3571.5150 3597.1598
redmass: 5.9200 6.6668 6.5500 6.5718 4.2482 4.7303 4.6194 6.5480 4.9853 5.2617 6.1165 5.2239 3.2597 5.1460 6.0162 6.2071 4.1852 4.8114 2.8091 2.0747 2.8298 2.7815 4.8304 3.7905 1.6012 4.0752 4.0397 5.4425 3.9254 5.2240 3.8298 1.1910 1.3511 1.2541 4.3162 1.4107 5.3526 5.0179 3.5886 3.0293 1.6034 2.0481 2.5209 1.7640 4.5403 4.1214 5.0806 4.1788 5.5186 2.7472 2.9751 5.1826 2.8976 5.2762 4.1782 4.6183 3.6105 3.9649 4.4560 3.7569 4.5390 5.3769 2.5504 2.4549 2.9195 3.3672 2.8286 2.8955 2.8782 2.9794 2.1457 2.1393 1.9283 1.2112 1.2768 1.2317 1.2390 1.2967 1.2024 1.3346 1.1792 1.3757 1.4099 1.2055 1.2138 1.2543 1.2459 1.2732 1.1860 1.3780 1.3049 1.2466 1.2668 1.3886 1.2079 1.3524 1.2605 1.2804 1.3887 1.3102 1.3716 1.2769 1.3898 1.7725 1.1576 1.0811 1.0789 1.0815 1.0704 1.0839 1.0642 1.0852 1.0850 1.0843 1.0862 1.0860 1.0874 1.0872 1.0860 1.0994 1.0940 1.0667 1.0658 1.0640 1.0654 1.0657 1.0656 1.0669 1.0669
irintensity: 2.3851 0.5595 5.4161 2.7099 12.9756 12.4792 9.6294 2.4835 12.0739 12.3302 5.6077 6.7180 2.9784 10.4765 1.5506 9.0303 4.6052 30.9105 24.3016 24.1357 15.7112 35.7429 34.3245 8.8083 64.1247 12.8030 24.6164 0.4034 11.8616 21.0846 22.8759 80.3895 182.3110 290.6577 5.6078 126.2372 2.7999 12.6331 4.7973 87.7395 38.9598 85.9978 44.9701 208.0755 25.3219 37.0029 46.5152 11.8563 47.3878 30.8417 7.6475 30.0641 31.9298 44.2416 176.7175 62.7616 36.2982 74.0428 179.7104 99.1049 86.2984 7.7363 22.9690 63.0029 33.5124 18.4925 145.0290 11.2018 98.5418 94.6669 15.4737 10.6360 16.7733 23.8228 11.4172 22.4672 38.6516 6.1981 17.1259 17.4983 25.7320 3.7478 9.1046 44.9449 20.3738 1.3630 18.7558 18.7234 2.6852 11.7821 23.4757 7.7956 15.3665 0.4330 8.0244 6.0272 14.7140 15.6212 3.1956 0.6511 20.3608 58.9554 2.2840 14.9464 59.9138 6.3839 10.8272 10.4616 54.8725 20.2092 37.9286 39.9732 10.0046 31.0259 37.7466 8.7864 3.7634 9.4360 16.1500 51.2078 7.6764 187.6519 62.2180 26.7256 10.6380 18.1582 21.1819 31.4107 28.7689
temp: 298.150 k
press: 1.00000 atm
elementType: 16 8 8 8 8 8 8 8 8 8 8 6 6 6 6 6 6 6 6 6 6 6 6 1 1 1 1 1 1 1 1 1 1 1 1 1 1 1 1 1 1 1 1 1 1
symmnumber: 1
zpe: 930945.8 jmol-1
zpe.correction: 0.354579 hartree
zpe.thermalcorrener: 0.379449 hartree
zpe.thermalcorrenthalpy: 0.380393 hartree
zpe.thermalcorrgfe: 0.301107 hartree
zpe.sumelectzpe: -1618.834405 hartree
zpe.sumelectthermal: -1618.809534 hartree
zpe.sumelectthermalent: -1618.808590 hartree
zpe.sumelectthermalfe: -1618.887876 hartree
dipole: -3.0586 -0.6641 1.8264
dipole: 3.6238
quadrupole: -161.0022 -145.4569 -152.3504
quadrupole: 20.0866 -2.2293 2.2288
quadrupole: -8.0657 7.4796 0.5861 20.0866 -2.2293 2.2288
hfenergy: -1619.1889833 hartree
pointgroup: C01 [X(C12H22O10S1)]
dipole: -1.2212693 -0.2093561 0.7052215 debye
polarizability: 220.7548972|4.7246499|180.5567095|4.8146696|-2.5452841|146.8275271 unknown
InChI: InChI=1S/C12H22O10S/c13-1-3-5(15)7(17)8(18)12(22-3)23-10-6(16)4(2-14)21-11(20)9(10)19/h3-20H,1-2H2
charge 0 multiplicity 1
45 atoms
S  0.054858 -0.18937 -0.616937
O  -1.95075 0.99475 0.975102
O  4.044944 -0.502358 -0.456667
O  2.976748 0.389508 2.291383
O  -1.524892 -2.706962 0.382726
O  3.359343 2.219555 0.155383
O  -4.161211 -2.185546 -0.668409
O  -4.629482 0.504505 -1.582856
O  4.272882 1.073018 -2.166449
O  1.370748 -3.045173 0.409098
O  -2.488005 3.695955 0.390742
C  1.463392 0.635659 0.386319
C  2.235417 -0.37198 1.272894
C  -1.211443 -0.243956 0.82295
C  -2.197108 -1.425378 0.638809
C  2.406355 1.359924 -0.59978
C  -3.118959 -1.16292 -0.560425
C  -3.855048 0.176375 -0.38832
C  3.196014 -1.289512 0.481289
C  -2.847485 1.320835 -0.18005
C  3.305383 0.37509 -1.387697
C  2.549571 -2.497314 -0.268169
C  -3.497984 2.655814 0.188349
H  0.957784 1.376731 1.030964
H  1.545472 -1.012083 1.846219
H  -0.623614 -0.345253 1.749932
H  -2.814217 -1.48935 1.559452
H  1.82881 1.971909 -1.318963
H  -2.51046 -1.134516 -1.490345
H  -4.521166 0.087005 0.498677
H  3.925662 -1.661986 1.220122
H  -2.217654 1.439306 -1.08346
H  2.699925 -0.212347 -2.102644
H  3.286107 -3.316222 -0.307844
H  2.305068 -2.209621 -1.309794
H  -4.128587 2.526057 1.093985
H  -4.129899 2.99542 -0.645889
H  3.562485 1.032222 1.801095
H  -1.260554 -3.143623 1.231737
H  2.946942 3.101211 0.328717
H  -3.718027 -3.066543 -0.770174
H  -5.185734 -0.287643 -1.80186
H  4.76413 1.677289 -1.547322
H  0.555463 -2.609893 0.032748
H  -1.860924 3.361209 1.082766
