program: Orca
programVersion: 5.0.2
elementType: O O O N C C C C C C C C C C C C C C C C C C C C C C C C H H H H H H H H H H H H H H H H H H H H H H H H H
charge: 0
multiplicity: 1
keywords: wb97x-d3
keywords: def2-TZVPP
keywords: def2/J RIJCOSX
keywords: DEFGRID2
keywords: scfconv7
keywords: smallprint printgap noloewdin
keywords: NOSOSCF
formula: C24H25NO3
InChI: InChI=1/C24H25NO3/c1-16(2)13-20-22(24(20,3)4)23(26)28-21(15-25)17-9-8-12-19(14-17)27-18-10-6-5-7-11-18/h5-14,20-22H,1-4H3
53 atoms
O  -1.182872 1.824157 0.109205
O  0.707499 0.830062 0.750491
O  -0.70721 -4.036453 -0.939994
N  -1.83393 -0.159637 2.785201
C  1.676403 3.806164 1.067831
C  2.202217 3.263747 -0.223137
C  0.726711 3.136116 0.082344
C  2.057925 3.119105 2.355186
C  1.509401 5.297916 1.214238
C  2.620914 4.142606 -1.344362
C  0.143453 1.817108 0.353631
C  3.881547 4.490903 -1.613937
C  5.054826 4.057587 -0.789935
C  4.211373 5.359333 -2.789948
C  -1.882085 0.60602 0.286068
C  -1.475363 -0.464416 -0.705963
C  -1.811454 0.168191 1.684825
C  -1.265737 -1.777184 -0.312096
C  -1.358891 -0.106642 -2.045201
C  -0.955448 -2.737742 -1.267898
C  -1.019046 -1.07026 -2.980998
C  -0.823626 -2.389812 -2.603944
C  -1.366181 -4.627038 0.106358
C  -2.742146 -4.512453 0.264906
C  -0.613496 -5.403898 0.97454
C  -3.359384 -5.178155 1.313747
C  -1.246658 -6.074722 2.011797
C  -2.61824 -5.961061 2.189445
H  2.759959 2.337054 -0.119217
H  0.068345 3.816439 -0.447325
H  1.253796 3.179072 3.090767
H  2.316209 2.071247 2.224386
H  2.929589 3.615346 2.785221
H  1.169121 5.776109 0.29681
H  0.786741 5.530215 1.998359
H  2.458748 5.759387 1.493143
H  1.8330 4.519191 -1.990622
H  4.776369 3.471542 0.084894
H  5.752196 3.462033 -1.385484
H  5.617312 4.927031 -0.439353
H  4.716205 6.276304 -2.474155
H  4.89671 4.851144 -3.473756
H  3.322974 5.641767 -3.355067
H  -2.928378 0.869853 0.108955
H  -1.335932 -2.058379 0.731557
H  -1.527082 0.91383 -2.364564
H  -0.918766 -0.79419 -4.022457
H  -0.569428 -3.144514 -3.33728
H  -3.331191 -3.914254 -0.419404
H  0.457486 -5.485411 0.835243
H  -4.430597 -5.087165 1.440458
H  -0.659303 -6.683576 2.68713
H  -3.107662 -6.479874 3.003191
elementType: O N C H
totalener: -1210.10472855 hartree
nucrepener: 2445.21452821 hartree
electener: -3655.31925676 hartree
oneelecener: -6502.73920362 hartree
twoeener: 2847.41994687 hartree
cpcmener: -0.03251505 hartree
kineticenergy: 1204.72069645 hartree
xcener: -118.587692162393 hartree
chargesum: -0.0000000
charge: -0.293255 -0.441772 -0.325977 -0.079260 0.141195 -0.011175 -0.123844 -0.295336 -0.268801 -0.256698 0.412857 -0.035832 -0.249594 -0.229832 0.516578 -0.044809 -0.262358 -0.175620 -0.275083 0.278281 -0.105809 -0.240793 0.270217 -0.185771 -0.239482 -0.141458 -0.122565 -0.180913 0.105520 0.090279 0.102804 0.096272 0.095839 0.092269 0.099919 0.097144 0.120215 0.087748 0.100255 0.095539 0.094541 0.094733 0.089161 0.144810 0.136437 0.143952 0.158296 0.146384 0.155304 0.146259 0.158764 0.156933 0.157531
qa: -0.2933 -0.4418 -0.3260 -0.0793 0.1412 -0.0112 -0.1238 -0.2953 -0.2688 -0.2567 0.4129 -0.0358 -0.2496 -0.2298 0.5166 -0.0448 -0.2624 -0.1756 -0.2751 0.2783 -0.1058 -0.2408 0.2702 -0.1858 -0.2395 -0.1415 -0.1226 -0.1809 0.1055 0.0903 0.1028 0.0963 0.0958 0.0923 0.0999 0.0971 0.1202 0.0877 0.1003 0.0955 0.0945 0.0947 0.0892 0.1448 0.1364 0.1440 0.1583 0.1464 0.1553 0.1463 0.1588 0.1569 0.1575
va: 2.1275 2.0692 2.0839 3.1037 3.6794 3.7942 3.9075 3.9023 3.9028 3.8652 4.1456 3.7055 3.9404 3.9278 3.7990 3.7398 4.1061 3.8883 3.9994 3.7724 3.9002 4.0187 3.7056 3.9146 4.0086 3.8903 3.8848 3.9043 1.0203 1.0383 1.0000 1.0179 1.0007 1.0027 1.0028 1.0020 1.0071 1.0080 0.9982 0.9979 0.9964 0.9954 1.0077 0.9872 1.0175 1.0109 0.9893 1.0068 0.9968 1.0077 0.9902 0.9895 0.9906
dispcorr: -0.025377729 hartree
energy: -1210.130106277486
dipole: 24.62180 -24.84875 -0.22695 31.48537 -29.92315 1.56222 -2.93072 1.22048 -1.71024
magnitude: 2.32743 au
magnitude: 5.91586 debye
