program: Orca
programVersion: 5.0.2
elementType: O O O N C C C C C C C C C C C C C C C C C C C C C C C C H H H H H H H H H H H H H H H H H H H H H H H H H
charge: 0
multiplicity: 1
keywords: wb97x-d3
keywords: def2-TZVPP
keywords: def2/J RIJCOSX
keywords: DEFGRID2
keywords: scfconv7
keywords: smallprint printgap noloewdin
keywords: NOSOSCF
formula: C24H25NO3
InChI: InChI=1/C24H25NO3/c1-16(2)13-20-22(24(20,3)4)23(26)28-21(15-25)17-9-8-12-19(14-17)27-18-10-6-5-7-11-18/h5-14,20-22H,1-4H3
53 atoms
O  -1.274747 1.858202 0.276038
O  0.61443 0.761607 0.723671
O  -0.785222 -3.873096 -1.071549
N  -1.796733 -0.217462 2.920347
C  1.723664 3.703198 1.017639
C  2.14313 3.143842 -0.305802
C  0.685679 3.077967 0.09384
C  2.151753 2.993038 2.277408
C  1.632217 5.200453 1.17817
C  2.525623 4.007535 -1.450006
C  0.065174 1.78221 0.396583
C  3.772141 4.204062 -1.887472
C  4.984075 3.591315 -1.257747
C  4.046507 5.077233 -3.073786
C  -2.018763 0.666799 0.470009
C  -1.75849 -0.374335 -0.598156
C  -1.852631 0.161965 1.837749
C  -1.369853 -1.668033 -0.28576
C  -1.941293 0.003968 -1.923801
C  -1.187064 -2.592718 -1.30789
C  -1.724336 -0.920668 -2.932881
C  -1.355512 -2.222602 -2.634266
C  -1.124307 -4.487871 0.107346
C  -2.443888 -4.54983 0.535756
C  -0.112715 -5.095895 0.832284
C  -2.742848 -5.224221 1.709932
C  -0.427936 -5.777691 1.999856
C  -1.739523 -5.8390 2.445992
H  2.665934 2.194143 -0.238514
H  0.024014 3.78793 -0.390248
H  1.392844 3.080602 3.05725
H  2.35915 1.935778 2.127107
H  3.066118 3.451364 2.658828
H  1.246193 5.697685 0.288464
H  0.978792 5.459864 2.013433
H  2.619233 5.619174 1.387736
H  1.715623 4.513722 -1.967339
H  5.512824 2.952349 -1.969264
H  5.691973 4.368645 -0.959399
H  4.760966 2.995487 -0.374844
H  4.556045 4.517678 -3.862669
H  3.133905 5.496736 -3.497135
H  4.707078 5.906576 -2.80837
H  -3.060549 0.990309 0.395993
H  -1.205804 -1.960341 0.743841
H  -2.251522 1.010785 -2.172654
H  -1.860157 -0.630263 -3.966152
H  -1.199494 -2.948501 -3.422111
H  -3.232373 -4.081096 -0.038743
H  0.910385 -5.03903 0.484321
H  -3.769852 -5.272645 2.04655
H  0.36095 -6.254902 2.565127
H  -1.980807 -6.365103 3.360105
elementType: O N C H
totalener: -1210.10503428 hartree
nucrepener: 2455.99738656 hartree
electener: -3666.10242084 hartree
oneelecener: -6524.44966963 hartree
twoeener: 2858.34724879 hartree
cpcmener: -0.03239039 hartree
kineticenergy: 1204.73660457 hartree
xcener: -118.589988671098 hartree
chargesum: -0.0000000
charge: -0.289424 -0.444334 -0.327689 -0.079678 0.151948 0.000488 -0.144043 -0.292817 -0.264712 -0.267757 0.424893 -0.029283 -0.249860 -0.227666 0.490145 -0.047938 -0.257125 -0.143052 -0.263223 0.252569 -0.112657 -0.235020 0.255616 -0.176768 -0.227722 -0.145509 -0.130660 -0.172263 0.101921 0.089371 0.101801 0.095028 0.095658 0.090648 0.098869 0.097116 0.118983 0.098528 0.095092 0.087425 0.094517 0.088121 0.093744 0.145655 0.134936 0.143066 0.158155 0.147369 0.156343 0.146449 0.158827 0.157649 0.158269
qa: -0.2894 -0.4443 -0.3277 -0.0797 0.1519 0.0005 -0.1440 -0.2928 -0.2647 -0.2678 0.4249 -0.0293 -0.2499 -0.2277 0.4901 -0.0479 -0.2571 -0.1431 -0.2632 0.2526 -0.1127 -0.2350 0.2556 -0.1768 -0.2277 -0.1455 -0.1307 -0.1723 0.1019 0.0894 0.1018 0.0950 0.0957 0.0906 0.0989 0.0971 0.1190 0.0985 0.0951 0.0874 0.0945 0.0881 0.0937 0.1457 0.1349 0.1431 0.1582 0.1474 0.1563 0.1464 0.1588 0.1576 0.1583
va: 2.1274 2.0695 2.0810 3.1042 3.6709 3.7802 3.9268 3.9062 3.9021 3.8768 4.1377 3.7076 3.9441 3.9272 3.8250 3.7297 4.0907 3.8491 3.9902 3.8019 3.9061 4.0119 3.7181 3.9208 4.0058 3.8939 3.8877 3.8989 1.0223 1.0392 0.9996 1.0176 1.0007 1.0031 1.0027 1.0027 1.0079 0.9977 0.9977 1.0085 0.9952 1.0082 0.9966 0.9895 1.0196 1.0091 0.9892 1.0060 0.9964 1.0070 0.9903 0.9896 0.9902
dispcorr: -0.025304936 hartree
energy: -1210.130339220065
dipole: 25.29102 -25.55815 -0.26713 29.78373 -28.22666 1.55707 -4.37394 2.78620 -1.58775
magnitude: 2.23981 au
magnitude: 5.69315 debye
