program: Orca
programVersion: 5.0.2
elementType: O O O N C C C C C C C C C C C C C C C C C C C C C C C C H H H H H H H H H H H H H H H H H H H H H H H H H
charge: 0
multiplicity: 1
keywords: wb97x-d3
keywords: def2-TZVPP
keywords: def2/J RIJCOSX
keywords: DEFGRID2
keywords: scfconv7
keywords: smallprint printgap noloewdin
keywords: NOSOSCF
formula: C24H25NO3
InChI: InChI=1/C24H25NO3/c1-16(2)13-20-22(24(20,3)4)23(26)28-21(15-25)17-9-8-12-19(14-17)27-18-10-6-5-7-11-18/h5-14,20-22H,1-4H3
53 atoms
O  -0.606994 1.614114 -0.196985
O  -1.134176 3.540529 0.794727
O  -0.010978 -3.289132 -0.791773
N  -2.011124 0.840171 2.788718
C  1.354663 4.617348 -0.828532
C  1.742281 4.334582 0.579106
C  1.022265 3.260317 -0.218935
C  0.261657 5.618936 -1.106965
C  2.414736 4.582975 -1.902161
C  3.149966 4.112542 0.999168
C  -0.334126 2.877097 0.183058
C  3.5380 3.202788 1.896663
C  2.58921 2.26212 2.576044
C  4.978003 3.040575 2.274988
C  -1.861787 1.077229 0.184915
C  -1.995276 -0.287917 -0.441711
C  -1.934379 0.964249 1.649216
C  -0.962877 -1.208882 -0.310495
C  -3.153679 -0.621898 -1.126999
C  -1.088074 -2.460338 -0.891098
C  -3.269077 -1.884264 -1.694037
C  -2.24167 -2.806759 -1.588532
C  -0.183499 -4.638917 -0.639507
C  0.666447 -5.468883 -1.355776
C  -1.119888 -5.166953 0.240988
C  0.580242 -6.843284 -1.185224
C  -1.202227 -6.543523 0.39224
C  -0.35661 -7.386397 -0.317027
H  1.107896 4.814373 1.321652
H  1.6316 2.437622 -0.575224
H  -0.451875 5.714298 -0.291742
H  0.703036 6.604335 -1.268818
H  -0.291259 5.3566 -2.011116
H  1.967524 4.368444 -2.87467
H  2.915617 5.550509 -1.97761
H  3.178331 3.82741 -1.716328
H  3.901665 4.757093 0.551539
H  2.686872 1.252109 2.167013
H  2.817464 2.185531 3.6415
H  1.544992 2.556288 2.483325
H  5.630794 3.709752 1.714457
H  5.128058 3.235182 3.340137
H  5.314355 2.015052 2.099319
H  -2.685528 1.720335 -0.139547
H  -0.05832 -0.96405 0.233972
H  -3.958718 0.095486 -1.223791
H  -4.166593 -2.149941 -2.23678
H  -2.339962 -3.780007 -2.052315
H  1.393633 -5.040074 -2.034079
H  -1.774978 -4.518122 0.809252
H  1.247253 -7.49003 -1.740704
H  -1.931485 -6.957073 1.076901
H  -0.424973 -8.458743 -0.189998
elementType: O N C H
totalener: -1210.10637475 hartree
nucrepener: 2416.52603018 hartree
electener: -3626.63240493 hartree
oneelecener: -6444.60668967 hartree
twoeener: 2817.97428474 hartree
cpcmener: -0.03119166 hartree
kineticenergy: 1204.71599673 hartree
xcener: -118.583488899852 hartree
chargesum: -0.0000000
charge: -0.284884 -0.450423 -0.326482 -0.093974 0.143940 -0.006443 -0.097005 -0.278082 -0.282491 -0.307416 0.378107 -0.003716 -0.241089 -0.227784 0.429132 -0.000008 -0.235492 -0.218194 -0.185098 0.217533 -0.137896 -0.167693 0.267967 -0.239913 -0.180985 -0.125944 -0.147571 -0.179238 0.106392 0.095367 0.094008 0.095569 0.099453 0.097780 0.099360 0.093544 0.122297 0.103469 0.101241 0.081349 0.088402 0.096501 0.094639 0.129349 0.138777 0.146505 0.160642 0.157675 0.146541 0.157488 0.157505 0.159326 0.157962
qa: -0.2849 -0.4504 -0.3265 -0.0940 0.1439 -0.0064 -0.0970 -0.2781 -0.2825 -0.3074 0.3781 -0.0037 -0.2411 -0.2278 0.4291 -0.0000 -0.2355 -0.2182 -0.1851 0.2175 -0.1379 -0.1677 0.2680 -0.2399 -0.1810 -0.1259 -0.1476 -0.1792 0.1064 0.0954 0.0940 0.0956 0.0995 0.0978 0.0994 0.0935 0.1223 0.1035 0.1012 0.0813 0.0884 0.0965 0.0946 0.1293 0.1388 0.1465 0.1606 0.1577 0.1465 0.1575 0.1575 0.1593 0.1580
va: 2.1474 2.0519 2.0752 3.1061 3.7090 3.8084 3.8309 3.8932 3.9087 3.8988 4.1501 3.6991 3.9395 3.9340 3.7280 3.7441 4.0121 4.0734 3.9561 3.8247 3.9132 3.9126 3.6988 4.0032 3.9053 3.8902 3.8924 3.9001 1.0244 1.0267 1.0167 1.0009 0.9993 1.0034 1.0000 1.0020 1.0043 0.9975 1.0010 1.0127 1.0064 0.9963 0.9959 1.0208 1.0278 1.0027 0.9912 0.9946 1.0076 0.9968 0.9894 0.9904 0.9904
dispcorr: -0.024838602 hartree
energy: -1210.131213351572
dipole: 21.73213 -21.24371 0.48842 19.70138 -20.54838 -0.84700 -1.04252 -1.18375 -2.22627
magnitude: 2.43151 au
magnitude: 6.18041 debye
