program: Orca
programVersion: 5.0.2
elementType: O O O N C C C C C C C C C C C C C C C C C C C C C C C C H H H H H H H H H H H H H H H H H H H H H H H H H
charge: 0
multiplicity: 1
keywords: wb97x-d3
keywords: def2-TZVPP
keywords: def2/J RIJCOSX
keywords: DEFGRID2
keywords: scfconv7
keywords: smallprint printgap noloewdin
keywords: NOSOSCF
formula: C24H25NO3
InChI: InChI=1/C24H25NO3/c1-16(2)13-20-22(24(20,3)4)23(26)28-21(15-25)17-9-8-12-19(14-17)27-18-10-6-5-7-11-18/h5-14,20-22H,1-4H3
53 atoms
O  -1.312506 1.997297 0.050795
O  0.436798 0.808201 0.754208
O  -0.815434 -3.735274 -0.944344
N  -2.182373 0.133965 2.772079
C  1.700601 3.695061 0.944423
C  2.260616 2.958724 -0.233588
C  0.758635 3.040668 -0.057204
C  1.880627 3.102086 2.319883
C  1.710278 5.203781 0.94361
C  2.877164 3.655549 -1.383775
C  0.001782 1.831838 0.292302
C  4.131098 3.50182 -1.820266
C  5.143169 2.590792 -1.195765
C  4.628046 4.268931 -3.008851
C  -2.160757 0.878342 0.26575
C  -1.90576 -0.245463 -0.715386
C  -2.129906 0.452805 1.669977
C  -1.475829 -1.500886 -0.310916
C  -2.110428 0.027991 -2.063376
C  -1.26894 -2.491096 -1.264437
C  -1.875499 -0.962169 -3.004179
C  -1.462061 -2.225348 -2.612899
C  -1.096883 -4.276328 0.284361
C  -0.040644 -4.795804 1.016514
C  -2.400721 -4.35742 0.75703
C  -0.294746 -5.408344 2.236269
C  -2.638655 -4.961068 1.982689
C  -1.590203 -5.487327 2.726482
H  2.681622 1.988997 0.011641
H  0.230475 3.73154 -0.70543
H  2.780667 3.515328 2.779435
H  1.038183 3.351442 2.968709
H  1.990409 2.019757 2.312397
H  1.499494 5.629682 -0.036657
H  0.963898 5.592356 1.63913
H  2.685687 5.576693 1.263215
H  2.23957 4.356731 -1.914689
H  6.032589 3.154891 -0.903007
H  4.780241 2.070831 -0.311292
H  5.481118 1.837859 -1.912483
H  3.852661 4.895563 -3.449938
H  5.467879 4.914259 -2.737049
H  4.997524 3.594114 -3.785803
H  -3.166282 1.271942 0.094706
H  -1.296483 -1.709694 0.736345
H  -2.452104 1.005371 -2.380335
H  -2.030112 -0.754202 -4.054709
H  -1.289025 -3.002799 -3.34629
H  0.969587 -4.724894 0.633263
H  -3.224185 -3.959368 0.176815
H  0.528696 -5.816799 2.80771
H  -3.653247 -5.024128 2.354254
H  -1.783709 -5.959005 3.680933
elementType: O N C H
totalener: -1210.10560809 hartree
nucrepener: 2465.55762224 hartree
electener: -3675.66323033 hartree
oneelecener: -6543.63629821 hartree
twoeener: 2867.97306788 hartree
cpcmener: -0.03245649 hartree
kineticenergy: 1204.71583843 hartree
xcener: -118.586563794216 hartree
chargesum: -0.0000000
charge: -0.286801 -0.446819 -0.327029 -0.080962 0.124927 0.038431 -0.143298 -0.281496 -0.262487 -0.283129 0.430841 -0.036398 -0.252127 -0.221481 0.474956 -0.045669 -0.252712 -0.130228 -0.259070 0.245752 -0.112050 -0.237297 0.259460 -0.229384 -0.180159 -0.130166 -0.144756 -0.173159 0.096827 0.088012 0.096279 0.099435 0.095169 0.088482 0.098325 0.097449 0.118443 0.094417 0.090346 0.096739 0.088412 0.093626 0.092909 0.146341 0.133609 0.143182 0.158148 0.147676 0.146564 0.156745 0.157978 0.158967 0.158229
qa: -0.2868 -0.4468 -0.3270 -0.0810 0.1249 0.0384 -0.1433 -0.2815 -0.2625 -0.2831 0.4308 -0.0364 -0.2521 -0.2215 0.4750 -0.0457 -0.2527 -0.1302 -0.2591 0.2458 -0.1121 -0.2373 0.2595 -0.2294 -0.1802 -0.1302 -0.1448 -0.1732 0.0968 0.0880 0.0963 0.0994 0.0952 0.0885 0.0983 0.0974 0.1184 0.0944 0.0903 0.0967 0.0884 0.0936 0.0929 0.1463 0.1336 0.1432 0.1581 0.1477 0.1466 0.1567 0.1580 0.1590 0.1582
va: 2.1309 2.0654 2.0820 3.1049 3.6893 3.7645 3.9090 3.9086 3.9026 3.8726 4.1351 3.7409 3.9451 3.9238 3.8357 3.7105 4.0786 3.8465 3.9904 3.8137 3.9030 4.0125 3.7129 4.0073 3.9230 3.8875 3.8930 3.8992 1.0295 1.0392 1.0004 0.9999 1.0175 1.0050 1.0025 1.0027 1.0093 0.9978 1.0088 0.9973 1.0086 0.9965 0.9962 0.9909 1.0225 1.0078 0.9891 1.0059 1.0069 0.9963 0.9894 0.9902 0.9902
dispcorr: -0.025058023 hartree
energy: -1210.130666113192
dipole: 27.24630 -27.26516 -0.01886 26.04470 -24.67592 1.36878 -4.16972 2.46951 -1.70022
magnitude: 2.18281 au
magnitude: 5.54825 debye
