program: Orca
programVersion: 5.0.2
elementType: O O O N C C C C C C C C C C C C C C C C C C C C C C C C H H H H H H H H H H H H H H H H H H H H H H H H H
charge: 0
multiplicity: 1
keywords: wb97x-d3
keywords: def2-TZVPP
keywords: def2/J RIJCOSX
keywords: DEFGRID2
keywords: scfconv7
keywords: smallprint printgap noloewdin
keywords: NOSOSCF
formula: C24H25NO3
InChI: InChI=1/C24H25NO3/c1-16(2)13-20-22(24(20,3)4)23(26)28-21(15-25)17-9-8-12-19(14-17)27-18-10-6-5-7-11-18/h5-14,20-22H,1-4H3
53 atoms
O  -0.640796 1.509106 -0.102969
O  -1.159201 3.600617 0.468397
O  -0.536436 -3.503212 0.232437
N  -2.548134 1.318905 2.69044
C  1.594874 4.253716 -0.926675
C  1.755381 4.235352 0.552366
C  1.095512 3.051121 -0.132446
C  0.618389 5.219314 -1.550451
C  2.799436 3.98064 -1.795141
C  3.077414 4.069774 1.20982
C  -0.329669 2.803228 0.108373
C  3.306633 3.330286 2.29801
C  2.246443 2.53312 2.994725
C  4.674451 3.235046 2.901416
C  -1.983322 1.125089 0.140561
C  -2.159908 -0.31323 -0.27865
C  -2.290495 1.260316 1.572354
C  -1.24308 -1.276252 0.125459
C  -3.260429 -0.665888 -1.045871
C  -1.442005 -2.599751 -0.236609
C  -3.451056 -1.996469 -1.392326
C  -2.552418 -2.969798 -0.989694
C  -0.218982 -4.613708 -0.504503
C  0.05115 -4.539633 -1.865662
C  -0.113287 -5.817638 0.175813
C  0.416703 -5.69203 -2.545796
C  0.267539 -6.95965 -0.515092
C  0.526498 -6.904394 -1.877309
H  1.050967 4.870698 1.085559
H  1.696414 2.154557 -0.233174
H  1.139853 6.140047 -1.819859
H  0.186983 4.808478 -2.465481
H  -0.198387 5.494863 -0.886965
H  2.491838 3.59672 -2.76956
H  3.363386 4.899824 -1.967423
H  3.479314 3.251912 -1.353386
H  3.906646 4.620899 0.774109
H  2.411779 1.461308 2.852354
H  2.280522 2.707718 4.072791
H  1.237406 2.761375 2.65598
H  5.008534 2.195189 2.951739
H  5.41568 3.799885 2.335971
H  4.67668 3.608905 3.928682
H  -2.682864 1.759794 -0.411758
H  -0.380205 -1.013929 0.726305
H  -3.967798 0.08836 -1.366192
H  -4.312928 -2.281353 -1.98109
H  -2.722966 -4.004484 -1.258331
H  -0.017855 -3.596984 -2.394434
H  -0.322156 -5.858169 1.237544
H  0.624083 -5.636003 -3.606648
H  0.3530 -7.898115 0.017357
H  0.815738 -7.798221 -2.414216
elementType: O N C H
totalener: -1210.10647764 hartree
nucrepener: 2415.39971350 hartree
electener: -3625.50619114 hartree
oneelecener: -6442.27496677 hartree
twoeener: 2816.76877563 hartree
cpcmener: -0.03136280 hartree
kineticenergy: 1204.70697497 hartree
xcener: -118.582348147144 hartree
chargesum: -0.0000000
charge: -0.287220 -0.449624 -0.324905 -0.094261 0.143647 -0.008219 -0.104507 -0.278113 -0.282737 -0.301918 0.384814 -0.008300 -0.236694 -0.227653 0.427010 -0.001199 -0.233996 -0.221425 -0.184669 0.228983 -0.140595 -0.170732 0.271442 -0.186268 -0.239113 -0.146211 -0.125460 -0.179898 0.106592 0.097147 0.095322 0.099282 0.094347 0.097959 0.099116 0.094037 0.121224 0.101783 0.100900 0.081027 0.093975 0.088961 0.096405 0.128510 0.137537 0.145950 0.160557 0.157186 0.157747 0.146688 0.159354 0.157583 0.158634
qa: -0.2872 -0.4496 -0.3249 -0.0943 0.1436 -0.0082 -0.1045 -0.2781 -0.2827 -0.3019 0.3848 -0.0083 -0.2367 -0.2277 0.4270 -0.0012 -0.2340 -0.2214 -0.1847 0.2290 -0.1406 -0.1707 0.2714 -0.1863 -0.2391 -0.1462 -0.1255 -0.1799 0.1066 0.0971 0.0953 0.0993 0.0943 0.0980 0.0991 0.0940 0.1212 0.1018 0.1009 0.0810 0.0940 0.0890 0.0964 0.1285 0.1375 0.1459 0.1606 0.1572 0.1577 0.1467 0.1594 0.1576 0.1586
va: 2.1489 2.0530 2.0791 3.1073 3.7067 3.8084 3.8388 3.8941 3.9089 3.8948 4.1417 3.7082 3.9367 3.9327 3.7250 3.7517 4.0113 4.0700 3.9566 3.8203 3.9176 3.9047 3.6966 3.9116 4.0057 3.8922 3.8883 3.9016 1.0247 1.0254 1.0012 0.9991 1.0167 1.0033 1.0002 1.0021 1.0045 0.9982 1.0006 1.0127 0.9965 1.0063 0.9965 1.0226 1.0281 1.0029 0.9913 0.9952 0.9959 1.0074 0.9904 0.9894 0.9902
dispcorr: -0.024681594 hartree
energy: -1210.131159237215
dipole: 24.32390 -23.28088 1.04303 18.83221 -19.94789 -1.11568 -2.24849 -0.21581 -2.46429
magnitude: 2.89921 au
magnitude: 7.36920 debye
