program: Gaussian 09
title: 000007248
version: EM64L-G09RevD.01
frameworkgroup: C1[X(C8H11N)]
method: RPBEPBE
basis: SDD
operation: Freq
keyword: #pfreq=noraman
keyword: PBEPBE/SDD
title: #p freq=noraman PBEPBE/SDD
converged: NO NO NO NO
title: Mulliken charges:
elementType: N C C C C C C C C H H H H H H H H H H H
charge: -0.708154 0.378704 0.318601 -0.627551 -0.398886 0.523877 -0.444247 -0.816481 -0.815119 0.217625 0.221561 0.212888 0.224454 0.223737 0.223740 0.219615 0.224820 0.219629 0.300808 0.300379
chargesum: 0.00000
title: Mulliken charges with hydrogens summed into heavy atoms:
elementType: N C C C C C C C C
charge: -0.106966 0.378704 0.318601 -0.409926 -0.177325 0.523877 -0.231359 -0.144550 -0.151055
polarizability: 1.29753651e+02 9.69417400e-01 1.00454954e+02 5.93644266e-04 -1.75746960e-04 4.86904374e+01
1716.lowfreq: 0.0006 0.0008 0.0009 13.1261 21.6973 25.2887 120.7714 137.9779 164.4171
frequency: 120.7609 137.9520 164.3744 216.2849 289.6649 300.8815 302.7541 327.1823 358.1531 438.3928 448.5267 473.3854 548.4959 581.7638 719.4825 726.3818 740.0625 808.8668 861.4882 931.8047 932.1889 982.9468 1002.0261 1028.0421 1048.8015 1051.3671 1123.3408 1177.1125 1224.7505 1277.5783 1327.4359 1377.7338 1391.9201 1404.5985 1435.1159 1462.7189 1476.6349 1476.7382 1479.8256 1510.4860 1587.5138 1631.6218 1640.5014 2958.9058 2967.4337 3028.9719 3042.1670 3070.0011 3075.4861 3105.6511 3108.0858 3133.4502 3571.0543 3713.9888
redmass: 1.4081 1.6824 1.1894 2.1981 2.5565 2.7107 1.2198 3.7030 1.0375 3.5479 2.6457 3.4332 4.6497 2.9482 2.3856 5.5665 3.9718 1.4350 1.5598 1.3449 2.6174 1.6550 1.4184 1.4283 1.4256 1.6206 1.9144 1.6399 1.9148 1.5444 2.9778 5.3749 1.2486 1.2656 2.2309 1.0470 1.3118 1.0474 1.1751 2.8584 6.4291 1.6993 2.3173 1.0374 1.0371 1.0973 1.0970 1.0979 1.0982 1.0908 1.0868 1.0968 1.0444 1.1042
irintensity: 1.0891 4.5946 1.0146 8.8740 0.7003 2.9133 261.3712 59.3310 0.0250 0.6703 5.1320 0.6535 0.5471 3.7421 3.2598 1.7620 1.1578 39.2163 30.2179 0.8767 0.4239 0.0112 15.8347 16.1205 4.7639 0.4179 14.7987 4.7248 10.8400 9.6830 38.6335 7.0102 6.7588 11.3303 8.1236 0.0123 18.6836 28.6564 0.3110 103.1052 20.5605 4.5085 277.3454 62.6174 35.9035 38.2290 16.5679 33.6269 15.4940 25.1119 25.4767 28.5878 55.5862 18.1408
temp: 298.150 k
press: 1.00000 atm
elementType: 7 6 6 6 6 6 6 6 6 1 1 1 1 1 1 1 1 1 1 1
symmnumber: 1
zpe: 444549.4 jmol-1
zpe.correction: 0.169320 hartree
zpe.thermalcorrener: 0.178672 hartree
zpe.thermalcorrenthalpy: 0.179617 hartree
zpe.thermalcorrgfe: 0.135922 hartree
zpe.sumelectzpe: -365.541888 hartree
zpe.sumelectthermal: -365.532536 hartree
zpe.sumelectthermalent: -365.531592 hartree
zpe.sumelectthermalfe: -365.575286 hartree
dipole: 1.3624 0.6622 0.0016
dipole: 1.5148
quadrupole: -41.6600 -48.9740 -59.7241
quadrupole: 0.8146 0.0057 0.0008
quadrupole: 8.4594 1.1454 -9.6047 0.8146 0.0057 0.0008
hfenergy: -365.7112081 hartree
pointgroup: C01 [X(C8H11N1)]
dipole: 0.5357488 -0.2610679 -0.0006199 debye
dipolederiv: -1.494813 0.2941424 -0.0002188 0.3338991 -0.1662263 0.0000481 -0.000638 0.0001334 -0.7705985 0.247596 -0.0209179 0.0000076 0.165403 0.316431 0.0000062 0.0000017 0.0000273 -0.0128232 0.0663724 -0.1186613 0.0000168 -0.1454991 -0.3288441 -0.0000025 0.0001174 -0.0000288 -0.1033586 -0.4724844 0.1216035 0.0000018 -0.2776946 0.0346775 -0.0000071 0.0000295 -0.0000387 -0.2700686 0.2112539 0.1749425 -0.0000041 -0.031624 0.1374765 0.0000014 -0.000026 0.0000112 -0.1503545 1.5511162 -0.3341524 0.0000758 -0.3865176 0.0753332 -0.0000197 0.0000181 -0.0000092 0.154897 -0.3299554 -0.0305317 0.0000088 0.4510557 -0.0492566 0.0000018 0.0000426 0.0000278 -0.2548681 -0.0506221 -0.1324194 0.0000063 -0.0842584 0.0044688 -0.0000041 -0.0000283 -0.0000255 0.0658981 -0.0449269 0.0351739 0.0000022 -0.0189263 0.088563 0.0000056 -0.000082 0.0000191 0.0952152 0.0323139 0.0675095 0.0000016 0.0770241 -0.1311082 0.0000019 0.000008 0.0000164 0.1645911 0.0579532 0.0826642 0.0000089 0.0611047 -0.1271739 -0.0000048 0.0000085 -0.0000124 0.1446845 -0.0726393 -0.1212541 0.0000015 -0.1071309 -0.0271173 0.0000029 0.0000049 -0.0000137 0.173424 0.036104 0.1532529 -0.0000267 0.0353812 -0.1259145 0.0000346 -0.000005 0.0000389 0.1056187 -0.0280766 -0.0509731 0.1126325 -0.0148334 0.0591933 -0.0419256 0.139249 0.017907 -0.0514461 -0.0280217 -0.0510079 -0.1126113 -0.0148961 0.0591762 0.0418888 -0.1392357 -0.0179487 -0.0515147 -0.0701361 -0.003623 0.0753235 -0.0499127 0.0624493 0.0982015 0.143161 0.0583846 -0.0620842 0.0738032 -0.0246457 -0.0000095 0.0970125 -0.1672547 -0.0000791 0.0000256 -0.0000679 0.1061008 -0.0701438 -0.0035375 -0.0753327 -0.0497811 0.0625402 -0.098126 -0.1431932 -0.0583073 -0.0622307 0.1884579 -0.0261496 0.000045 -0.035959 0.1150739 -0.0000672 0.0002479 -0.0001589 0.3892825 0.1968488 -0.0114151 0.000071 -0.0038471 0.1075128 0.0000434 0.000294 0.0000453 0.3896351 unknown
polarizability: 129.7517404|-0.9978727|100.4568652|-0.0005938|-0.0001752|48.6904374 unknown
InChI: InChI=1S/C8H11N/c1-6-3-4-8(9)5-7(6)2/h3-5H,9H2,1-2H3
charge 0 multiplicity 1
20 atoms
N  3.005832 -0.415855 -0.000135
C  -0.729937 -0.796179 -0.000098
C  -1.151683 0.568509 -0.000103
C  0.64979 -1.106062 -0.000127
C  -0.155619 1.576128 -0.000114
C  1.643482 -0.086679 -0.000162
C  1.221541 1.270956 -0.000148
C  -1.753199 -1.919908 -0.00009
C  -2.626842 0.938039 -0.000168
H  0.961313 -2.159218 -0.000091
H  -0.464901 2.628895 -0.000086
H  1.965006 2.077937 -0.00013
H  -1.264542 -2.910118 0.000091
H  -2.412288 -1.868851 0.888213
H  -2.412052 -1.86906 -0.888585
H  -3.153906 0.538541 0.888727
H  -2.758014 2.034641 0.00016
H  -3.153643 0.539112 -0.889481
H  3.305973 -1.385487 -0.00053
H  3.712987 0.312258 -0.000542
