program: Orca
programVersion: 5.0.2
elementType: O O O N C C C C C C C C C C C C C C C C C C C C C C C C H H H H H H H H H H H H H H H H H H H H H H H H H
charge: 0
multiplicity: 1
keywords: wb97x-d3
keywords: def2-TZVPP
keywords: def2/J RIJCOSX
keywords: DEFGRID2
keywords: scfconv7
keywords: smallprint printgap noloewdin
keywords: NOSOSCF
formula: C24H25NO3
InChI: InChI=1/C24H25NO3/c1-16(2)13-20-22(24(20,3)4)23(26)28-21(15-25)17-9-8-12-19(14-17)27-18-10-6-5-7-11-18/h5-14,20-22H,1-4H3
53 atoms
O  -0.799621 1.651241 -0.249705
O  -1.313383 3.713262 0.426278
O  -0.376376 -3.303862 0.363513
N  -2.561048 1.436195 2.653143
C  1.444763 4.538836 -0.812716
C  1.704962 4.121808 0.592588
C  0.911662 3.201746 -0.32606
C  0.513613 5.696093 -1.078244
C  2.563172 4.433273 -1.822175
C  3.050297 3.700809 1.060968
C  -0.497546 2.943149 -0.015143
C  3.308345 2.622362 1.805103
C  2.256091 1.663679 2.274697
C  4.707204 2.278439 2.215444
C  -2.102554 1.208019 0.084932
C  -2.202696 -0.252887 -0.277795
C  -2.344258 1.367354 1.526919
C  -1.230667 -1.140202 0.167774
C  -3.270966 -0.702073 -1.03912
C  -1.338767 -2.486384 -0.145897
C  -3.370782 -2.054076 -1.337532
C  -2.416089 -2.953695 -0.893301
C  -0.033434 -4.464906 -0.278898
C  0.248467 -4.493028 -1.639253
C  0.088632 -5.608565 0.495932
C  0.643984 -5.687952 -2.222162
C  0.499313 -6.793886 -0.098188
C  0.771198 -6.840901 -1.45822
H  1.091036 4.633404 1.331288
H  1.450269 2.334274 -0.689345
H  -0.198967 5.868432 -0.274976
H  1.098649 6.610682 -1.194797
H  -0.047891 5.54917 -2.002968
H  3.206962 3.571481 -1.645417
H  2.159022 4.342048 -2.832243
H  3.190192 5.327001 -1.797811
H  3.879738 4.342224 0.774358
H  1.242178 2.045896 2.174317
H  2.31446 0.720594 1.723186
H  2.410043 1.412766 3.326737
H  5.440302 2.976719 1.811594
H  4.807913 2.273649 3.303873
H  4.976497 1.274093 1.877168
H  -2.866621 1.782606 -0.447748
H  -0.392081 -0.79991 0.76475
H  -4.021905 -0.007176 -1.392416
H  -4.206489 -2.415252 -1.922153
H  -2.519449 -4.005525 -1.126598
H  0.165709 -3.596212 -2.240686
H  -0.129511 -5.568353 1.555844
H  0.860817 -5.71271 -3.282321
H  0.598237 -7.685215 0.507816
H  1.083983 -7.768067 -1.920181
elementType: O N C H
totalener: -1210.10520982 hartree
nucrepener: 2436.85082072 hartree
electener: -3646.95603054 hartree
oneelecener: -6485.15822763 hartree
twoeener: 2838.20219709 hartree
cpcmener: -0.03179718 hartree
kineticenergy: 1204.71261195 hartree
xcener: -118.583421335528 hartree
chargesum: -0.0000000
charge: -0.282441 -0.446872 -0.323586 -0.090269 0.151228 -0.000706 -0.124323 -0.284035 -0.282406 -0.298958 0.383270 -0.011767 -0.237155 -0.226847 0.424254 0.001664 -0.236909 -0.227924 -0.192151 0.239978 -0.135513 -0.182018 0.272237 -0.190872 -0.236838 -0.143834 -0.126623 -0.178079 0.110391 0.098684 0.094589 0.093699 0.099523 0.092861 0.098409 0.098846 0.121271 0.081071 0.103721 0.103304 0.088620 0.096706 0.094009 0.128222 0.139133 0.145701 0.160694 0.156098 0.158736 0.146821 0.159399 0.158296 0.158692
qa: -0.2824 -0.4469 -0.3236 -0.0903 0.1512 -0.0007 -0.1243 -0.2840 -0.2824 -0.2990 0.3833 -0.0118 -0.2372 -0.2268 0.4243 0.0017 -0.2369 -0.2279 -0.1922 0.2400 -0.1355 -0.1820 0.2722 -0.1909 -0.2368 -0.1438 -0.1266 -0.1781 0.1104 0.0987 0.0946 0.0937 0.0995 0.0929 0.0984 0.0988 0.1213 0.0811 0.1037 0.1033 0.0886 0.0967 0.0940 0.1282 0.1391 0.1457 0.1607 0.1561 0.1587 0.1468 0.1594 0.1583 0.1587
va: 2.1437 2.0568 2.0820 3.1064 3.7020 3.8061 3.8532 3.8918 3.9090 3.8946 4.1436 3.7121 3.9342 3.9318 3.7392 3.7432 4.0227 4.0676 3.9613 3.8260 3.9128 3.9054 3.6913 3.9215 4.0072 3.8889 3.8870 3.9012 1.0198 1.0254 1.0183 1.0007 0.9993 1.0027 1.0028 1.0006 1.0043 1.0096 0.9976 1.0005 1.0063 0.9967 0.9966 1.0191 1.0258 1.0028 0.9911 0.9965 0.9953 1.0072 0.9902 0.9892 0.9902
dispcorr: -0.025332028 hartree
energy: -1210.130541846923
dipole: 24.14847 -23.10144 1.04703 16.32289 -17.63545 -1.31256 -3.59002 1.10234 -2.48768
magnitude: 3.00127 au
magnitude: 7.62863 debye
