program: Gaussian 09
title: 000072430
version: EM64L-G09RevD.01
frameworkgroup: C1[X(C22H26N2O4)]
method: RPBEPBE
basis: SDD
operation: Freq
keyword: #p
keyword: freq=noraman
keyword: PBEPBE/SDD
title: #p freq=noraman PBEPBE/SDD
converged: YES YES NO NO
title: Mulliken charges:
elementType: O O O O N N C C C C C C C C C C C C C C C C C C C C C C H H H H H H H H H H H H H H H H H H H H H H H H H H
charge: -0.268446 -0.291852 -0.186028 -0.342423 -0.411108 -0.383605 -0.097068 -0.211378 0.215250 -0.074527 -0.732620 -0.706537 -0.653575 0.528560 -0.085419 0.335876 -0.440286 -0.391562 -0.213624 -0.231726 -0.417539 -0.260615 0.472874 -0.444966 -0.348628 -0.219572 -0.232383 -0.236130 0.235465 0.270730 0.284320 0.279905 0.223236 0.179486 0.216124 0.212194 0.222979 0.366209 0.336312 0.258570 0.227719 0.203096 0.235152 0.231254 0.231859 0.226609 0.235998 0.241510 0.230524 0.234546 0.253323 0.230241 0.229927 0.231770
chargesum: 0.00000
title: Mulliken charges with hydrogens summed into heavy atoms:
elementType: O O O O N N C C C C C C C C C C C C C C C C C C C C C C
charge: -0.268446 -0.291852 -0.186028 -0.342423 -0.044898 -0.047293 0.138397 0.059351 0.215250 0.209793 -0.049993 -0.055241 -0.167286 0.528560 0.117677 0.335876 -0.205134 -0.160309 0.018235 -0.005118 0.059970 -0.030091 0.472874 -0.210420 -0.095305 0.010669 -0.002455 -0.004360
polarizability: 3.29069678e+02 4.37033229e+00 2.13771596e+02 -5.11055296e+00 -1.48065188e+01 2.27555370e+02
1716.lowfreq: -20.9540 -7.7114 -6.8768 0.0006 0.0006 0.0008 2.5727 7.5346 10.7758
frequency: -20.3198 -4.0111 10.4950 22.7953 37.2194 39.5030 44.5095 50.8449 55.6700 75.7598 92.1820 101.8463 109.0631 111.6928 132.9368 146.0540 163.4008 173.7656 209.2623 220.9602 230.7999 233.1515 253.0925 262.2297 278.6120 295.9428 303.1958 339.3524 359.3203 390.5607 401.7432 404.6528 412.8802 437.7761 454.1556 487.6613 509.0801 537.4171 557.0775 570.9081 585.5973 616.7718 616.9456 633.9665 661.4523 690.6765 698.6225 701.3858 704.7159 742.2358 750.8783 776.3134 797.0970 802.5616 820.7542 830.2942 844.6359 849.1076 854.8311 868.1733 888.9851 908.2718 915.7784 919.3263 925.6889 960.6672 964.4907 972.2277 977.9618 982.1958 989.6072 990.7362 993.4138 996.6736 999.3649 1010.8985 1027.2890 1027.7147 1045.9584 1067.9046 1088.6106 1092.1185 1104.3628 1126.2081 1157.9570 1172.7025 1173.7505 1187.7915 1189.1191 1193.9917 1195.5083 1196.7147 1207.9926 1217.9787 1227.0527 1234.0284 1256.7071 1271.4035 1300.3431 1314.1789 1322.0184 1322.8676 1326.1491 1341.8621 1351.4282 1357.5405 1366.2243 1382.4384 1383.3322 1387.6227 1399.2206 1440.9833 1441.1320 1463.4444 1469.3422 1471.0488 1474.2220 1477.6561 1484.7149 1487.0485 1488.2244 1501.4827 1517.6923 1592.6712 1595.6209 1601.3584 1614.9670 1617.7471 1629.2465 1638.7942 2904.2520 2955.4577 2964.2787 2974.1581 2984.2014 2996.9325 3006.3756 3016.6447 3052.8824 3056.9751 3068.4170 3069.2433 3076.7911 3105.7619 3113.2569 3114.2908 3120.3252 3127.3065 3130.4013 3139.9147 3142.2545 3150.8385 3160.8702 3165.7398 3308.0598 3560.0162
redmass: 3.8093 5.4468 5.0941 4.9887 5.6062 5.4497 4.1021 6.9000 4.8774 3.1755 4.0439 5.8307 3.7772 3.4652 4.9958 4.7901 5.3777 4.4652 1.3964 3.1414 4.3626 1.3335 2.5815 4.9346 5.1180 3.1896 3.1611 2.4488 4.0935 2.7202 2.7875 2.8252 3.6018 3.0261 3.5576 3.6875 3.2386 4.3049 5.0341 2.1263 1.6211 6.3443 6.3668 4.8779 4.4424 6.5227 5.5106 1.8884 2.1880 2.0795 1.6990 3.9396 1.4286 1.8774 3.0977 3.5487 3.1607 1.2549 1.2576 1.8856 3.7463 2.0810 1.4529 1.2850 1.9533 3.3454 1.5270 1.4047 1.4549 1.8191 5.4634 5.9291 1.4262 1.8819 1.4021 2.4492 2.2030 2.1877 2.0651 2.6904 1.5617 1.8363 2.1789 2.8234 2.4717 1.0559 1.0548 1.1392 1.1547 1.7674 1.2058 1.5197 1.8726 2.3900 2.2977 1.8108 1.3525 1.7964 1.2950 1.5116 1.3610 1.3936 1.3790 1.3908 1.4255 1.4224 1.2401 1.2334 6.4821 5.5659 1.2156 2.1367 2.1513 1.3140 1.1135 1.1258 1.0647 1.2539 2.3018 1.2953 1.6688 1.1672 1.7633 6.0243 6.2807 7.4967 6.1188 6.0850 5.6279 9.1829 1.0874 1.0803 1.0437 1.0366 1.0828 1.0608 1.0574 1.0837 1.1009 1.0927 1.1067 1.0986 1.0989 1.0994 1.0877 1.0868 1.0871 1.0868 1.0906 1.0921 1.0953 1.0964 1.1013 1.1016 1.0845 1.0768
irintensity: 0.2079 0.5103 0.1647 0.2015 2.4470 0.6042 0.1493 4.3828 0.1473 0.9829 2.1952 4.8097 3.2391 6.2082 6.3147 2.6349 9.5536 1.0461 2.7548 7.6933 3.0825 2.9587 10.2410 7.1195 11.4634 1.7746 0.9061 3.7138 5.9035 0.0011 0.3476 0.3309 2.1041 1.0146 13.3748 23.1222 6.9320 10.1575 29.0876 53.3528 40.8679 0.2897 1.1733 5.0076 10.5212 6.0682 15.0878 75.7689 28.8219 54.9779 31.0604 48.8808 98.1544 69.7920 3.4449 8.4282 0.8230 2.5798 1.9892 10.6491 24.3404 3.3864 0.3837 15.5101 6.7479 140.3689 1.8444 0.4421 5.3445 16.7836 0.2811 0.0820 1.7416 2.9906 0.1356 13.9490 0.8359 10.9505 8.7280 92.4685 5.2394 11.6737 5.0469 24.9084 8.8189 0.1191 0.0122 1.0914 9.7564 19.4307 1.0735 1.7984 263.5985 0.1851 7.5216 11.4869 36.5210 36.7932 2.0952 67.8883 0.8627 1.0665 11.6219 1.5463 10.6491 1.8920 2.5044 30.7110 0.8606 3.1500 27.2051 15.8701 10.7565 118.4323 46.0013 47.0099 8.0612 76.6206 24.2535 4.0425 15.1671 172.2420 289.1877 1.0835 3.2574 77.1891 11.8123 0.8979 312.3572 190.2023 89.5939 14.0999 30.5876 28.7215 8.9926 10.0646 19.2440 5.8857 10.3945 27.4890 17.1178 52.0342 50.4677 11.7045 8.3979 4.7856 6.4248 0.5725 7.4032 16.1502 51.1265 30.1607 16.4130 22.0821 255.3969 52.9263
temp: 298.150 k
press: 1.00000 atm
elementType: 8 8 8 8 7 7 6 6 6 6 6 6 6 6 6 6 6 6 6 6 6 6 6 6 6 6 6 6 1 1 1 1 1 1 1 1 1 1 1 1 1 1 1 1 1 1 1 1 1 1 1 1 1 1
symmnumber: 1
zpe: 1149922.4 jmol-1
zpe.correction: 0.437982 hartree
zpe.thermalcorrener: 0.464304 hartree
zpe.thermalcorrenthalpy: 0.465248 hartree
zpe.thermalcorrgfe: 0.378505 hartree
zpe.sumelectzpe: -1262.300494 hartree
zpe.sumelectthermal: -1262.274173 hartree
zpe.sumelectthermalent: -1262.273229 hartree
zpe.sumelectthermalfe: -1262.359972 hartree
dipole: -4.9987 2.2498 0.7629
dipole: 5.5345
quadrupole: -172.5334 -164.0768 -163.6218
quadrupole: 10.8487 3.0255 -9.0366
quadrupole: -5.7894 2.6672 3.1222 10.8487 3.0255 -9.0366
hfenergy: -1262.7384766 hartree
pointgroup: C01 [X(C22H26N2O4)]
dipole: 2.1658123 -0.1796655 0.1347535 debye
polarizability: 311.6712653|41.9316046|223.9979798|5.8465774|12.2390269|234.7273995 unknown
InChI: InChI=1S/C22H26N2O4/c1-16(2)20(24-22(27)28-15-18-11-7-4-8-12-18)21(26)23-19(14-25)13-17-9-5-3-6-10-17/h3-12,14,16,19-20,23-24H,13,15H2,1-2H3
charge 0 multiplicity 1
54 atoms
O  -3.065937 -2.590568 0.594754
O  1.855729 -0.61102 -1.001792
O  -5.914457 0.395215 -1.394359
O  -0.129625 -0.402173 -2.261186
N  -2.578404 -0.848302 -0.868169
N  0.167256 -2.089343 -0.658784
C  -0.987475 -4.293096 -0.456098
C  -1.092315 -2.815197 -0.925175
C  -2.330286 -2.085864 -0.310939
C  -3.686261 -0.005406 -0.394806
C  -0.557198 -4.435474 1.024893
C  -0.059359 -5.099311 -1.394659
C  -3.380543 1.507208 -0.523626
C  -2.301313 2.003169 0.426882
C  -4.979965 -0.396775 -1.137962
C  0.565983 -0.994683 -1.377255
C  -1.06287 2.485462 -0.065966
C  -2.52185 2.015103 1.829322
C  -0.070249 2.972858 0.81608
C  -1.532395 2.495324 2.714512
C  2.375967 0.635168 -1.647815
C  -0.301273 2.978338 2.210443
C  3.562941 1.1133 -0.844787
C  4.810411 1.332841 -1.477099
C  3.434857 1.377786 0.543572
C  5.914476 1.819334 -0.739152
C  4.538792 1.852309 1.283238
C  5.781214 2.079234 0.643295
H  -2.014748 -4.697211 -0.532774
H  -1.238866 -2.805158 -2.024656
H  -3.865297 -0.275675 0.668957
H  -1.20915 -3.836871 1.681433
H  -0.635974 -5.492877 1.334733
H  0.499982 -4.142133 1.190028
H  -0.417841 -5.074619 -2.440756
H  0.972918 -4.701298 -1.38188
H  -0.014481 -6.156894 -1.077304
H  -1.915447 -0.484335 -1.575814
H  0.778908 -2.419475 0.089397
H  -4.335601 2.036172 -0.345974
H  -3.09776 1.726222 -1.571025
H  -5.024725 -1.474093 -1.433268
H  -0.879069 2.483505 -1.14776
H  -3.478696 1.657378 2.231018
H  0.875661 3.357657 0.417078
H  -1.722783 2.501465 3.793717
H  2.652772 0.397966 -2.69005
H  1.549386 1.369264 -1.66559
H  0.463106 3.361894 2.895709
H  4.922129 1.120727 -2.547513
H  2.475589 1.194685 1.040817
H  6.874382 1.987202 -1.239802
H  4.433078 2.047069 2.356387
H  6.636576 2.451198 1.218232
