program: Orca
programVersion: 5.0.2
elementType: O O O N C C C C C C C C C C C C C C C C C C C C C C C C H H H H H H H H H H H H H H H H H H H H H H H H H
charge: 0
multiplicity: 1
keywords: wb97x-d3
keywords: def2-TZVPP
keywords: def2/J RIJCOSX
keywords: DEFGRID2
keywords: scfconv7
keywords: smallprint printgap noloewdin
keywords: NOSOSCF
formula: C24H25NO3
InChI: InChI=1/C24H25NO3/c1-16(2)13-20-22(24(20,3)4)23(26)28-21(15-25)17-9-8-12-19(14-17)27-18-10-6-5-7-11-18/h5-14,20-22H,1-4H3
53 atoms
O  -0.829355 0.827116 1.451851
O  -0.876311 2.418223 -0.116688
O  -1.924617 -3.254024 -1.556182
N  -3.012462 -0.560284 3.49728
C  2.093572 1.44575 -0.51278
C  2.091559 2.754203 0.21592
C  1.222387 1.618862 0.724148
C  1.468524 1.378346 -1.884737
C  3.26653 0.509573 -0.357072
C  3.226724 3.202542 1.046594
C  -0.237592 1.699148 0.611906
C  3.775115 4.419929 0.998206
C  3.290434 5.499643 0.066396
C  4.922867 4.78444 1.888847
C  -2.242849 0.704542 1.343411
C  -2.643294 -0.067497 0.108365
C  -2.656399 -0.005656 2.554811
C  -2.073226 -1.314969 -0.12083
C  -3.549646 0.476715 -0.787582
C  -2.412577 -2.010671 -1.271212
C  -3.893472 -0.24208 -1.92499
C  -3.324433 -1.478351 -2.176435
C  -0.691028 -3.637839 -1.081516
C  0.441708 -2.862236 -1.294546
C  -0.606524 -4.862978 -0.439095
C  1.670734 -3.330339 -0.85379
C  0.631876 -5.322877 -0.011522
C  1.772274 -4.558743 -0.212777
H  1.5454 3.543495 -0.291136
H  1.57981 1.097628 1.605001
H  0.999121 0.406275 -2.05413
H  0.722647 2.150567 -2.060438
H  2.24614 1.501567 -2.641102
H  2.980274 -0.506222 -0.636504
H  4.084497 0.814746 -1.012797
H  3.650851 0.473429 0.661165
H  3.634117 2.47957 1.746784
H  2.267895 5.806957 0.295195
H  3.914951 6.389704 0.136726
H  3.30016 5.178319 -0.976185
H  4.671772 5.640245 2.521165
H  5.218632 3.960612 2.538225
H  5.795169 5.083201 1.30183
H  -2.733783 1.68285 1.354389
H  -1.376638 -1.735563 0.594956
H  -3.981062 1.451703 -0.602246
H  -4.599218 0.17229 -2.632137
H  -3.584318 -2.033114 -3.068896
H  0.373723 -1.906652 -1.800886
H  -1.499436 -5.454239 -0.281485
H  2.555818 -2.730346 -1.020377
H  0.699485 -6.281068 0.486428
H  2.735302 -4.917986 0.124238
elementType: O N C H
totalener: -1210.09266379 hartree
nucrepener: 2519.44498519 hartree
electener: -3729.53764898 hartree
oneelecener: -6650.08083447 hartree
twoeener: 2920.54318549 hartree
cpcmener: -0.03681652 hartree
kineticenergy: 1204.69189877 hartree
xcener: -118.581282354444 hartree
chargesum: 0.0000000
charge: -0.286495 -0.470545 -0.337156 -0.101523 0.107514 0.047138 -0.089471 -0.269618 -0.268556 -0.315530 0.386185 -0.013315 -0.282496 -0.221056 0.429613 0.013312 -0.225105 -0.203889 -0.214215 0.261502 -0.108590 -0.243883 0.253541 -0.195423 -0.223805 -0.173411 -0.136163 -0.173797 0.096537 0.093707 0.090851 0.095638 0.100412 0.084790 0.100181 0.091663 0.122680 0.103180 0.095860 0.104617 0.098263 0.085678 0.096882 0.142482 0.146968 0.150456 0.162581 0.150576 0.189061 0.148796 0.181528 0.161404 0.160447
qa: -0.2865 -0.4705 -0.3372 -0.1015 0.1075 0.0471 -0.0895 -0.2696 -0.2686 -0.3155 0.3862 -0.0133 -0.2825 -0.2211 0.4296 0.0133 -0.2251 -0.2039 -0.2142 0.2615 -0.1086 -0.2439 0.2535 -0.1954 -0.2238 -0.1734 -0.1362 -0.1738 0.0965 0.0937 0.0909 0.0956 0.1004 0.0848 0.1002 0.0917 0.1227 0.1032 0.0959 0.1046 0.0983 0.0857 0.0969 0.1425 0.1470 0.1505 0.1626 0.1506 0.1891 0.1488 0.1815 0.1614 0.1604
va: 2.1243 2.0359 2.0719 3.1109 3.6850 3.7908 3.8645 3.8967 3.9167 3.8985 4.1846 3.6961 3.9400 3.9186 3.7148 3.6050 4.0889 3.9304 3.9659 3.7483 3.8941 4.0076 3.7322 3.9194 3.9958 3.8969 3.8849 3.9081 1.0250 1.0357 1.0031 1.0180 1.0013 1.0101 1.0025 1.0064 1.0083 0.9967 1.0046 0.9955 0.9926 1.0100 0.9933 1.0165 1.0166 1.0034 0.9877 1.0048 0.9727 1.0061 0.9782 0.9880 0.9906
dispcorr: -0.027124676 hartree
energy: -1210.119788466170
dipole: 32.84292 -31.10150 1.74142 20.88559 -20.29832 0.58727 -5.29375 4.07922 -1.21453
magnitude: 2.20284 au
magnitude: 5.59918 debye
