program: Orca
programVersion: 5.0.2
elementType: O O O N C C C C C C C C C C C C C C C C C C C C C C C C H H H H H H H H H H H H H H H H H H H H H H H H H
charge: 0
multiplicity: 1
keywords: wb97x-d3
keywords: def2-TZVPP
keywords: def2/J RIJCOSX
keywords: DEFGRID2
keywords: scfconv7
keywords: smallprint printgap noloewdin
keywords: NOSOSCF
formula: C24H25NO3
InChI: InChI=1/C24H25NO3/c1-16(2)13-20-22(24(20,3)4)23(26)28-21(15-25)17-9-8-12-19(14-17)27-18-10-6-5-7-11-18/h5-14,20-22H,1-4H3
53 atoms
O  -1.21878 1.939125 -0.571924
O  0.482739 0.513593 -0.846139
O  -2.054783 -3.753857 0.05168
N  -4.227293 2.35331 -1.851241
C  1.528613 2.161581 1.645449
C  2.314987 2.519955 0.42174
C  0.808427 2.559264 0.361124
C  1.523112 0.727818 2.113733
C  1.438466 3.157679 2.773498
C  3.06416 3.797076 0.31507
C  0.063257 1.557606 -0.410679
C  4.385636 3.925713 0.460728
C  5.303026 2.784034 0.771613
C  5.055432 5.25885 0.324575
C  -2.093682 0.998094 -1.1870
C  -2.446692 -0.125571 -0.242431
C  -3.28272 1.769732 -1.551747
C  -2.096053 -1.424793 -0.573492
C  -3.073566 0.154917 0.966789
C  -2.358526 -2.448857 0.327494
C  -3.350734 -0.88134 1.843109
C  -2.986566 -2.18415 1.534795
C  -0.87887 -4.068699 -0.585457
C  -0.915494 -5.139063 -1.467659
C  0.311149 -3.397843 -0.329024
C  0.25233 -5.543537 -2.09841
C  1.468097 -3.807036 -0.977309
C  1.446337 -4.876012 -1.863078
H  2.764899 1.668178 -0.079989
H  0.347031 3.540589 0.388154
H  1.713319 0.011906 1.316618
H  2.303742 0.590108 2.864086
H  0.571039 0.469681 2.581762
H  2.313649 3.076977 3.421379
H  1.381453 4.186929 2.420873
H  0.555308 2.964982 3.384956
H  2.479926 4.688908 0.107529
H  4.784132 1.838423 0.919107
H  6.03624 2.646047 -0.02722
H  5.875276 2.992499 1.679103
H  5.57969 5.528195 1.245047
H  5.811071 5.239364 -0.46501
H  4.347343 6.054342 0.093797
H  -1.665237 0.602105 -2.112823
H  -1.615932 -1.629522 -1.522499
H  -3.347857 1.170169 1.225406
H  -3.843711 -0.675053 2.783436
H  -3.189969 -2.991241 2.226665
H  -1.849771 -5.653701 -1.6533
H  0.348489 -2.568648 0.366615
H  0.222351 -6.380539 -2.783602
H  2.394757 -3.283869 -0.781062
H  2.353491 -5.188696 -2.362367
elementType: O N C H
totalener: -1210.09273941 hartree
nucrepener: 2487.53696060 hartree
electener: -3697.62970001 hartree
oneelecener: -6586.49984600 hartree
twoeener: 2888.87014599 hartree
cpcmener: -0.03477723 hartree
kineticenergy: 1204.69930972 hartree
xcener: -118.581981583305 hartree
chargesum: 0.0000000
charge: -0.279988 -0.471866 -0.339507 -0.102314 0.151846 -0.003001 -0.124702 -0.291165 -0.267759 -0.273432 0.404882 -0.032520 -0.250338 -0.230088 0.418812 0.015582 -0.219159 -0.198005 -0.226998 0.280309 -0.129048 -0.223516 0.297626 -0.252837 -0.198666 -0.124347 -0.154756 -0.187513 0.102407 0.095962 0.089277 0.100332 0.101625 0.097234 0.092837 0.099596 0.124092 0.087826 0.099825 0.095708 0.095018 0.095138 0.090175 0.137922 0.150260 0.147829 0.163068 0.151052 0.148396 0.161105 0.161506 0.162388 0.161892
qa: -0.2800 -0.4719 -0.3395 -0.1023 0.1518 -0.0030 -0.1247 -0.2912 -0.2678 -0.2734 0.4049 -0.0325 -0.2503 -0.2301 0.4188 0.0156 -0.2192 -0.1980 -0.2270 0.2803 -0.1290 -0.2235 0.2976 -0.2528 -0.1987 -0.1243 -0.1548 -0.1875 0.1024 0.0960 0.0893 0.1003 0.1016 0.0972 0.0928 0.0996 0.1241 0.0878 0.0998 0.0957 0.0950 0.0951 0.0902 0.1379 0.1503 0.1478 0.1631 0.1511 0.1484 0.1611 0.1615 0.1624 0.1619
va: 2.1302 2.0346 2.0713 3.1100 3.6670 3.7905 3.8912 3.9054 3.9025 3.8719 4.1777 3.7012 3.9419 3.9261 3.7246 3.5707 4.0770 3.9346 3.9738 3.7191 3.9043 4.0164 3.6778 4.0012 3.8955 3.8787 3.8970 3.9018 1.0206 1.0363 1.0133 1.0023 0.9993 1.0025 1.0022 1.0029 1.0065 1.0078 0.9977 0.9979 0.9963 0.9952 1.0075 1.0177 1.0077 1.0096 0.9883 1.0039 1.0076 0.9917 0.9878 0.9896 0.9890
dispcorr: -0.026509215 hartree
energy: -1210.119248625938
dipole: 34.40643 -32.43104 1.97539 17.66888 -17.70173 -0.03285 14.35962 -13.10704 1.25257
magnitude: 2.33927 au
magnitude: 5.94595 debye
