program: Gaussian 09
title: 000072417
version: EM64L-G09RevD.01
frameworkgroup: C1[X(C18H14ClN3O)]
method: RPBEPBE
basis: SDD
operation: Freq
keyword: #p
keyword: freq=noraman
keyword: PBEPBE/SDD
title: #p freq=noraman PBEPBE/SDD
converged: YES YES NO NO
title: Mulliken charges:
elementType: Cl O N N N C C C C C C C C C C C C C C C C C C H H H H H H H H H H H H H H
charge: -0.064075 -0.266176 -0.477582 -0.442884 -0.013376 -0.152297 -0.497638 -0.490061 0.183708 0.329935 0.134439 0.276306 0.078408 -0.324198 -0.396306 -0.156224 -0.142126 -0.213738 0.049229 -0.311031 -0.193106 -0.368374 -0.177102 0.251842 0.245682 0.229219 0.244595 0.242039 0.345248 0.270911 0.329879 0.235801 0.257783 0.254915 0.244067 0.246920 0.235367
chargesum: 0.00000
title: Mulliken charges with hydrogens summed into heavy atoms:
elementType: Cl O N N N C C C C C C C C C C C C C C C C C C
charge: -0.064075 -0.266176 -0.132334 -0.113004 -0.013376 0.099545 -0.022737 -0.003427 0.183708 0.329935 0.134439 0.276306 0.078408 -0.053287 -0.160505 -0.156224 -0.142126 0.044045 0.049229 -0.056116 0.050960 -0.121454 0.058265
polarizability: 3.08816486e+02 1.17500116e+01 2.61712305e+02 1.25217096e+01 5.34293221e+00 1.34499204e+02
1716.lowfreq: -8.7898 -5.9851 -0.0012 -0.0008 0.0009 4.9219 5.2123 21.3854 24.1656
frequency: 5.0602 21.3290 23.9828 49.3707 51.9179 84.1448 92.6881 109.8158 122.4710 153.6724 181.8261 200.6472 236.5135 253.7725 294.4973 312.0842 326.8613 345.0283 370.4968 400.3226 401.7856 428.3040 464.5845 475.0109 501.8914 513.2166 518.7327 549.5412 559.6103 574.8337 576.6287 593.0710 619.3511 632.6189 669.9173 712.2736 721.3738 743.2964 765.6131 774.0549 793.4502 793.8976 810.6492 827.7116 837.1143 879.6743 895.5942 902.2047 915.7443 936.5799 947.9384 954.9706 963.6020 976.0507 1002.8086 1032.0272 1046.8155 1050.0439 1056.7320 1074.2797 1083.2540 1086.6769 1102.2241 1136.6953 1138.5738 1162.8413 1165.0304 1200.4235 1221.1003 1248.2162 1267.8410 1271.7084 1286.9109 1307.1313 1342.4240 1351.4780 1376.9346 1392.5425 1403.2167 1411.7487 1438.8445 1442.9929 1447.6105 1468.2309 1487.7649 1552.5559 1573.9109 1598.0440 1613.0728 1663.0382 2268.1169 3100.2654 3107.4653 3120.5105 3131.3498 3136.6943 3144.2597 3157.8179 3161.8751 3175.4379 3175.6674 3197.3150 3214.9936 3567.6633 3570.6857
redmass: 4.5351 7.3053 5.4108 4.0487 4.5430 8.1575 4.1390 5.3353 4.3788 6.7597 8.0654 5.5420 5.5190 4.3870 5.7821 6.8769 4.7494 5.7320 4.6915 7.8185 3.7929 5.1320 5.2627 4.0450 2.5456 6.4763 4.3987 3.4065 3.3345 2.1494 5.0747 1.2492 6.7471 5.9469 5.5159 6.2758 4.0891 1.9295 1.4948 3.4052 2.2619 2.4659 1.5084 1.5188 2.7869 3.9395 1.6252 1.3144 4.2737 1.3570 4.8835 5.1871 1.4446 5.1723 1.3440 3.1042 1.5151 1.8906 2.2695 1.2648 2.0626 1.8191 1.1905 1.5111 2.5903 1.3963 1.0752 3.1565 1.9981 1.4340 1.8692 1.7071 5.4035 4.1552 2.2607 2.5851 5.2188 2.7182 1.8061 1.9603 1.0988 2.4264 2.3920 1.3477 3.2824 5.3033 5.7035 7.8104 7.2357 4.7847 11.9931 1.0525 1.0617 1.0891 1.0884 1.0899 1.0892 1.0922 1.0948 1.1018 1.0959 1.1164 1.1145 1.0766 1.0782
irintensity: 1.7893 0.5936 0.8566 0.5467 0.2526 1.4238 1.1231 0.4682 1.2296 1.0227 2.2205 0.4753 0.3409 0.5070 2.0012 0.5831 1.4857 1.7938 1.6532 10.9213 3.9993 0.7609 6.6748 11.6197 1.1810 18.8771 7.0938 1.0295 14.2955 36.2180 22.4114 147.4803 4.4123 7.8512 12.0296 74.4265 1.6578 25.7169 2.8603 1.1466 35.0879 31.9150 56.2977 20.9233 7.5281 23.4415 18.2188 0.2177 1.4873 1.4488 3.7694 18.4227 1.1932 14.4145 0.0321 2.6996 4.8260 35.9911 18.3242 9.0098 26.0539 1.1910 1.3920 6.8805 4.8258 1.9760 1.9773 14.0978 3.9987 35.9054 20.8132 4.8305 18.2014 2.6348 93.9662 71.8240 354.9992 14.6213 22.1307 6.7456 15.8802 27.1993 97.3408 4.4601 144.3922 15.5999 73.6637 14.1431 3.4573 669.2449 13.1411 15.8470 11.7273 3.3244 16.0758 10.3468 6.0427 0.4312 23.4687 17.5168 3.2609 0.5457 17.8709 66.4879 30.1310
temp: 298.150 k
press: 1.00000 atm
elementType: 17 8 7 7 7 6 6 6 6 6 6 6 6 6 6 6 6 6 6 6 6 6 6 1 1 1 1 1 1 1 1 1 1 1 1 1 1
symmnumber: 1
zpe: 727349.0 jmol-1
zpe.correction: 0.277033 hartree
zpe.thermalcorrener: 0.297049 hartree
zpe.thermalcorrenthalpy: 0.297993 hartree
zpe.thermalcorrgfe: 0.224047 hartree
zpe.sumelectzpe: -1392.191687 hartree
zpe.sumelectthermal: -1392.171671 hartree
zpe.sumelectthermalent: -1392.170726 hartree
zpe.sumelectthermalfe: -1392.244673 hartree
dipole: 1.3063 3.1209 1.0154
dipole: 3.5323
quadrupole: -106.5317 -157.2666 -142.6030
quadrupole: 2.2305 -1.5327 -11.6814
quadrupole: 28.9354 -21.7995 -7.1359 2.2305 -1.5327 -11.6814
hfenergy: -1392.4687197 hartree
pointgroup: C01 [X(C18H14Cl1N3O1)]
dipole: 0.580248 1.1654799 0.4861097 debye
polarizability: 309.9256218|8.1038195|259.227285|13.7075914|13.71019|135.875089 unknown
InChI: InChI=1S/C18H14ClN3O/c19-13-6-7-16-15(11-13)18(12-4-5-12,22-17(23)21-16)9-8-14-3-1-2-10-20-14/h1-3,6-7,10-12,21-22H,4-5H2
charge 0 multiplicity 1
37 atoms
Cl -1.586228 4.473042 1.02977
O  -2.628069 -3.038478 -1.938586
N  -1.093394 -1.827199 -0.655923
N  -3.213922 -0.927399 -1.12992
N  4.173284 -1.082749 0.060875
C  -0.979686 -1.225515 1.795179
C  -0.716074 -2.661045 2.25118
C  -2.157699 -2.126373 2.177616
C  -0.736323 -0.765439 0.325611
C  -1.607462 0.478973 0.057518
C  0.706738 -0.464671 0.17343
C  -2.854241 0.331292 -0.607583
C  -2.323583 -2.004381 -1.27514
C  -1.226055 1.745496 0.544253
C  -3.714916 1.448388 -0.754734
C  -2.092626 2.841314 0.387345
C  1.917494 -0.250067 0.071087
C  -3.341172 2.710202 -0.250662
C  3.328553 0.000642 -0.054714
C  3.805661 1.322026 -0.288442
C  5.194604 1.535965 -0.40135
C  5.510164 -0.848686 -0.057136
C  6.069429 0.431503 -0.283975
H  -0.722878 -0.433886 2.50862
H  -0.25232 -2.807493 3.230256
H  -0.4267 -3.403654 1.501185
H  -2.790056 -2.524133 1.379195
H  -2.688184 -1.904916 3.107808
H  -0.40861 -2.564788 -0.8269
H  -0.258117 1.86941 1.039573
H  -4.111492 -1.04868 -1.600617
H  -4.674614 1.335579 -1.271833
H  -4.003456 3.572955 -0.363163
H  3.093306 2.147431 -0.379951
H  5.58622 2.542777 -0.579954
H  6.153477 -1.731277 0.03637
H  7.153845 0.552933 -0.366488
