program: Orca
programVersion: 5.0.2
elementType: O O O N C C C C C C C C C C C C C C C C C C C C C C C C H H H H H H H H H H H H H H H H H H H H H H H H H
charge: 0
multiplicity: 1
keywords: wb97x-d3
keywords: def2-TZVPP
keywords: def2/J RIJCOSX
keywords: DEFGRID2
keywords: scfconv7
keywords: smallprint printgap noloewdin
keywords: NOSOSCF
formula: C24H25NO3
InChI: InChI=1/C24H25NO3/c1-16(2)13-20-22(24(20,3)4)23(26)28-21(15-25)17-9-8-12-19(14-17)27-18-10-6-5-7-11-18/h5-14,20-22H,1-4H3
53 atoms
O  -1.39627 1.963404 0.985505
O  -0.521624 2.093749 -1.067395
O  -1.254872 -3.047498 0.606754
N  -4.390666 1.707863 2.352755
C  1.994525 1.239027 0.721062
C  2.170207 2.59854 0.109365
C  0.895488 2.285201 0.858565
C  1.805549 0.055876 -0.196995
C  2.72364 0.881799 1.993053
C  3.094067 3.609372 0.661721
C  -0.367921 2.120391 0.128298
C  3.925285 4.393774 -0.032675
C  4.078239 4.379701 -1.522874
C  4.799955 5.389863 0.668615
C  -2.644322 1.605611 0.411713
C  -2.628717 0.213265 -0.178782
C  -3.606972 1.671991 1.511811
C  -1.942193 -0.803733 0.472915
C  -3.28754 -0.034447 -1.372582
C  -1.914339 -2.068941 -0.088802
C  -3.264753 -1.313097 -1.91287
C  -2.578857 -2.336728 -1.279999
C  -0.398397 -3.891238 -0.056535
C  0.414044 -3.458686 -1.097755
C  -0.332166 -5.199911 0.400036
C  1.294836 -4.357612 -1.683492
C  0.559315 -6.083873 -0.190154
C  1.373001 -5.66967 -1.236084
H  2.055771 2.607517 -0.969073
H  0.790931 2.700805 1.854939
H  1.196686 -0.714034 0.281676
H  1.340551 0.313669 -1.146752
H  2.776176 -0.389745 -0.422719
H  2.781653 1.709774 2.697771
H  2.219896 0.055654 2.498017
H  3.742648 0.559512 1.770479
H  3.080423 3.726026 1.741507
H  5.123908 4.216792 -1.796127
H  3.485429 3.616674 -2.023134
H  3.799466 5.348551 -1.945717
H  4.612509 6.402032 0.300795
H  4.644354 5.388983 1.747255
H  5.856837 5.185044 0.479259
H  -2.960857 2.332768 -0.34349
H  -1.421527 -0.624551 1.40606
H  -3.811196 0.765134 -1.880464
H  -3.781958 -1.513718 -2.841331
H  -2.563512 -3.329793 -1.710631
H  0.372744 -2.435544 -1.450095
H  -0.970513 -5.521105 1.213259
H  1.928221 -4.022007 -2.494117
H  0.609423 -7.10372 0.167911
H  2.063422 -6.362611 -1.697838
elementType: O N C H
totalener: -1210.09341134 hartree
nucrepener: 2496.30287297 hartree
electener: -3706.39628431 hartree
oneelecener: -6603.88180884 hartree
twoeener: 2897.48552454 hartree
cpcmener: -0.03687033 hartree
kineticenergy: 1204.69342831 hartree
xcener: -118.582844190729 hartree
chargesum: 0.0000000
charge: -0.283922 -0.458715 -0.342485 -0.102139 0.125832 0.031714 -0.081572 -0.286814 -0.275385 -0.286207 0.372457 -0.050285 -0.252715 -0.218691 0.421567 0.024539 -0.221761 -0.264299 -0.193971 0.244384 -0.131118 -0.162197 0.306468 -0.193934 -0.251186 -0.175050 -0.129314 -0.182498 0.093781 0.096419 0.089061 0.099183 0.107988 0.091722 0.098500 0.099573 0.122025 0.095395 0.090387 0.097956 0.093315 0.088920 0.094186 0.146157 0.143679 0.148312 0.164373 0.161363 0.162312 0.148000 0.161711 0.161020 0.161956
qa: -0.2839 -0.4587 -0.3425 -0.1021 0.1258 0.0317 -0.0816 -0.2868 -0.2754 -0.2862 0.3725 -0.0503 -0.2527 -0.2187 0.4216 0.0245 -0.2218 -0.2643 -0.1940 0.2444 -0.1311 -0.1622 0.3065 -0.1939 -0.2512 -0.1750 -0.1293 -0.1825 0.0938 0.0964 0.0891 0.0992 0.1080 0.0917 0.0985 0.0996 0.1220 0.0954 0.0904 0.0980 0.0933 0.0889 0.0942 0.1462 0.1437 0.1483 0.1644 0.1614 0.1623 0.1480 0.1617 0.1610 0.1620
va: 2.1154 2.0447 2.0474 3.1096 3.6921 3.8075 3.8122 3.9010 3.9044 3.8787 4.2143 3.7621 3.9400 3.9196 3.7009 3.5907 4.0847 4.0091 3.9830 3.7659 3.8916 3.9163 3.6365 3.8722 4.0074 3.9273 3.8866 3.8942 1.0303 1.0337 1.0001 1.0130 1.0021 1.0057 1.0022 1.0013 1.0100 0.9973 1.0101 0.9962 0.9961 1.0087 0.9963 1.0144 1.0238 1.0014 0.9886 0.9928 0.9913 1.0077 0.9906 0.9880 0.9886
dispcorr: -0.027080833 hartree
energy: -1210.120492171718
dipole: 34.67617 -32.81834 1.85783 12.40384 -12.82992 -0.42608 -4.37069 3.07488 -1.29581
magnitude: 2.30482 au
magnitude: 5.85840 debye
