program: Gaussian 09
title: 000072415
version: EM64L-G09RevD.01
frameworkgroup: C1[X(C15H24O4)]
method: RPBEPBE
basis: SDD
operation: Freq
keyword: #pfreq=noraman
keyword: PBEPBE/SDD
title: #p freq=noraman PBEPBE/SDD
converged: YES YES NO NO
title: Mulliken charges:
elementType: O O O O C C C C C C C C C C C C C C C H H H H H H H H H H H H H H H H H H H H H H H H
charge: -0.243805 -0.207788 -0.176821 -0.455178 -0.169851 0.133310 -0.490126 -0.004232 -0.481689 0.529860 -0.665676 -0.445418 0.276969 -0.427077 -0.752129 -0.133559 -0.738161 -0.297836 -0.747456 0.264761 0.257109 0.198482 0.217886 0.243285 0.211468 0.222657 0.203865 0.215650 0.241963 0.222645 0.214182 0.210038 0.219979 0.251137 0.223804 0.218583 0.241629 0.206713 0.210642 0.343515 0.225515 0.212059 0.219096
chargesum: 0.00000
title: Mulliken charges with hydrogens summed into heavy atoms:
elementType: O O O O C C C C C C C C C C C C C C C
charge: -0.243805 -0.207788 -0.176821 -0.111663 0.094910 0.133310 -0.034535 0.213654 -0.026936 0.529860 -0.239154 0.012196 0.276969 -0.204433 -0.107930 0.117579 -0.054145 0.119519 -0.090787
polarizability: 2.10709887e+02 -6.60233277e+00 1.70162892e+02 -1.16942145e+00 -2.95234277e+00 1.39422481e+02
1716.lowfreq: -9.5834 -4.8575 -0.0007 -0.0006 0.0001 10.6759 51.9495 66.6907 88.4200
frequency: 51.9164 66.6642 88.4015 117.4209 145.2234 161.3071 180.4749 195.8706 205.1601 211.3676 218.8227 231.6073 239.5186 249.9901 275.6384 278.9678 308.8240 339.0129 347.7502 362.0655 381.0966 401.6220 407.4196 418.1024 434.0682 444.1573 476.9150 511.4498 530.4777 547.3423 585.2529 602.4818 624.7833 659.5477 686.7873 741.4824 770.9861 799.7007 821.5055 830.5219 860.1819 867.4248 880.4246 891.5337 904.6950 906.5244 931.2893 942.5418 953.6993 961.7557 988.3020 998.7790 1027.4289 1034.6346 1054.9753 1076.3288 1082.7445 1092.1516 1104.1816 1109.7609 1117.0678 1135.1525 1149.6460 1167.2551 1172.4964 1181.1647 1190.9934 1215.7674 1255.0019 1255.2988 1260.8279 1269.8935 1277.0222 1285.9116 1309.4499 1317.4749 1322.9254 1329.4849 1330.6995 1343.0825 1350.9043 1360.6509 1368.6942 1382.0027 1385.5196 1386.3982 1390.9191 1438.6580 1440.3623 1450.1547 1456.7779 1458.1016 1472.8800 1473.1587 1475.7473 1477.4355 1478.5691 1480.1265 1663.2922 2940.4721 2963.2737 2966.3574 2966.7065 2974.6092 2981.3085 2990.5143 2992.1682 2994.3611 3002.3895 3014.1175 3024.9623 3037.4377 3049.0742 3062.0666 3066.5831 3068.2338 3073.7993 3075.8876 3079.7193 3087.3464 3089.1062 3110.9879 3538.0231
redmass: 4.3586 3.5611 3.4326 3.0056 4.4745 2.4549 3.5065 2.2591 1.5542 1.0703 1.4786 1.8866 1.9239 2.5441 2.7549 2.6596 2.9679 4.5266 4.3901 1.5779 2.3417 2.2255 3.3777 2.9601 1.9748 2.8360 3.2647 3.6364 3.2466 4.8291 5.6486 3.5258 4.0508 4.1038 4.9409 3.4962 3.4225 6.7043 1.6647 2.3006 2.3887 1.9075 2.1330 1.9489 1.9639 1.9826 1.7745 1.7256 1.8941 2.1919 4.2872 2.0229 2.3527 3.2115 1.5885 1.9471 2.2762 2.4028 2.0066 1.8689 1.5345 3.2401 2.5180 2.7518 2.5967 1.9599 1.4566 1.8221 1.2262 1.3027 1.3165 1.2939 1.3653 1.3354 1.4438 1.2778 1.3995 1.4241 1.4060 1.3749 1.4637 1.4315 1.4873 1.7030 1.2522 1.2307 1.2144 1.0909 1.0845 1.0900 1.0599 1.0892 1.0593 1.0627 1.0575 1.0445 1.0534 1.0714 8.9287 1.0656 1.0811 1.0506 1.0407 1.0368 1.0630 1.0634 1.0378 1.0796 1.0843 1.0630 1.0962 1.1058 1.0987 1.0989 1.0991 1.0984 1.1022 1.0921 1.0973 1.0992 1.0978 1.1005 1.0652
irintensity: 0.9587 0.6625 0.7682 0.3806 2.2140 0.6562 3.4735 0.6899 1.7167 0.0722 1.6157 3.0292 0.7439 6.2744 1.6829 0.9584 2.1577 0.3262 3.3266 57.5965 56.3937 7.9846 13.6990 9.6409 1.3666 3.9759 14.9819 11.5808 3.8593 15.7057 6.6965 4.1781 1.0881 4.3080 2.4547 16.8862 50.6829 7.3361 26.0558 14.2204 4.3252 5.0718 42.6550 7.8364 4.5289 18.0835 0.9836 16.4347 6.0464 2.5989 91.0275 7.9305 0.3606 25.3803 9.7159 70.0496 12.2246 3.3610 4.0313 47.1978 0.1902 63.2540 0.5522 3.2660 15.6114 7.2650 7.3888 0.2616 1.4151 1.6743 17.1158 2.0120 2.1059 1.9440 6.5692 6.4609 9.5283 6.7379 1.1722 1.2472 8.2837 8.8358 0.8521 18.5424 33.4261 13.4306 14.8505 16.7744 1.5908 1.2713 8.8078 7.5669 5.2394 8.1189 12.9282 11.3301 9.7818 18.1898 1.9208 14.8661 27.1613 100.8010 9.3506 61.3802 36.3051 37.7630 13.4079 14.8649 1.5757 28.9352 29.0395 22.2943 13.8607 57.5021 43.7438 32.8397 9.8062 33.0668 40.8164 13.5352 23.1375 19.9798 3.1178
temp: 298.150 k
press: 1.00000 atm
elementType: 8 8 8 8 6 6 6 6 6 6 6 6 6 6 6 6 6 6 6 1 1 1 1 1 1 1 1 1 1 1 1 1 1 1 1 1 1 1 1 1 1 1 1
symmnumber: 1
zpe: 963278.2 jmol-1
zpe.correction: 0.366893 hartree
zpe.thermalcorrener: 0.385766 hartree
zpe.thermalcorrenthalpy: 0.386710 hartree
zpe.thermalcorrgfe: 0.322407 hartree
zpe.sumelectzpe: -885.292007 hartree
zpe.sumelectthermal: -885.273134 hartree
zpe.sumelectthermalent: -885.272190 hartree
zpe.sumelectthermalfe: -885.336493 hartree
dipole: 0.8839 1.1696 -0.8611
dipole: 1.7002
quadrupole: -101.5360 -117.1507 -113.7331
quadrupole: 1.5767 0.7643 -0.2390
quadrupole: 9.2706 -6.3441 -2.9265 1.5767 0.7643 -0.2390
hfenergy: -885.6589 hartree
pointgroup: C01 [X(C15H24O4)]
dipole: -0.3530355 -0.4537943 -0.3418708 debye
polarizability: 210.5642914|-7.0456725|170.2647749|1.0785863|3.1780948|139.4661934 unknown
InChI: InChI=1S/C15H24O4/c1-10-4-12-6-11(2)8-18-19-15(12)9-17-14(3,16)7-13(15)5-10/h6,10-11,13,16H,4-5,7-9H2,1-3H3
charge 0 multiplicity 1
43 atoms
O  1.827712 1.593516 -1.117173
O  -0.613304 1.550181 0.36934
O  -1.535221 1.221705 1.549304
O  3.503074 -0.077334 -0.679907
C  0.895975 -0.336043 0.957989
C  -0.068217 0.242595 -0.125767
C  1.327226 -1.796087 0.666766
C  0.119448 -2.729489 0.428666
C  2.092093 0.629579 1.167298
C  -1.180784 -0.741698 -0.504982
C  -0.718189 -2.172585 -0.754562
C  0.714241 0.675995 -1.394703
C  2.793857 1.091773 -0.124411
C  -2.501112 -0.415011 -0.60683
C  0.564865 -4.182393 0.16408
C  -3.150034 0.945063 -0.373635
C  3.760438 2.259694 0.091041
C  -2.91327 1.456262 1.068523
C  -4.667896 0.907118 -0.667094
H  0.30884 -0.342584 1.89779
H  2.005431 -1.825164 -0.206373
H  1.919786 -2.159563 1.530104
H  -0.523487 -2.714138 1.334831
H  1.723432 1.539567 1.67255
H  2.845341 0.153726 1.821515
H  -1.597576 -2.81745 -0.941709
H  -0.084121 -2.2253 -1.66682
H  1.089471 -0.232591 -1.90494
H  0.05256 1.234581 -2.076171
H  -3.193482 -1.228043 -0.874801
H  -0.303767 -4.851148 0.015093
H  1.197863 -4.241207 -0.742469
H  1.15535 -4.57775 1.011453
H  -2.681714 1.68375 -1.051147
H  4.558643 1.967023 0.794011
H  4.218219 2.558084 -0.870244
H  3.223851 3.134033 0.494184
H  -3.158599 2.535302 1.135928
H  -3.52086 0.891446 1.804159
H  4.009974 0.230855 -1.475689
H  -4.853919 0.641645 -1.723278
H  -5.176924 0.15642 -0.032722
H  -5.140512 1.889064 -0.478998
