program: Orca
programVersion: 5.0.2
elementType: O O O N C C C C C C C C C C C C C C C C C C C C C C C C H H H H H H H H H H H H H H H H H H H H H H H H H
charge: 0
multiplicity: 1
keywords: wb97x-d3
keywords: def2-TZVPP
keywords: def2/J RIJCOSX
keywords: DEFGRID2
keywords: scfconv7
keywords: smallprint printgap noloewdin
keywords: NOSOSCF
formula: C24H25NO3
InChI: InChI=1/C24H25NO3/c1-16(2)13-20-22(24(20,3)4)23(26)28-21(15-25)17-9-8-12-19(14-17)27-18-10-6-5-7-11-18/h5-14,20-22H,1-4H3
53 atoms
O  -1.336684 1.929836 1.000702
O  -0.47084 2.115761 -1.052099
O  -1.056767 -3.047993 0.579714
N  -4.338453 1.67352 2.355633
C  2.124946 1.365696 0.618496
C  2.185287 2.791157 0.158543
C  0.946271 2.296208 0.875482
C  2.02443 0.277258 -0.422236
C  2.89668 0.937814 1.842816
C  3.029004 3.809717 0.813537
C  -0.312922 2.122286 0.143593
C  3.771803 4.714637 0.169701
C  3.838076 4.800601 -1.332698
C  4.59166 5.717248 0.921979
C  -2.579173 1.560514 0.426397
C  -2.560039 0.162354 -0.150669
C  -3.547216 1.62902 1.522179
C  -1.80186 -0.828692 0.458878
C  -3.308466 -0.117568 -1.283499
C  -1.795709 -2.104781 -0.081102
C  -3.306314 -1.405586 -1.800046
C  -2.554741 -2.406764 -1.206265
C  -0.359202 -3.99135 -0.134937
C  0.333233 -3.674169 -1.297199
C  -0.324898 -5.276566 0.385436
C  1.051241 -4.668525 -1.946251
C  0.40766 -6.257116 -0.268338
C  1.092124 -5.96072 -1.438902
H  2.060843 2.912954 -0.912833
H  0.828285 2.597695 1.910355
H  1.459432 -0.5777 -0.042977
H  1.559343 0.605916 -1.349231
H  3.025909 -0.078186 -0.671693
H  2.47097 0.022904 2.25855
H  3.936504 0.730087 1.582902
H  2.893587 1.688118 2.632099
H  3.03157 3.818159 1.899196
H  4.541012 5.56929 -1.652481
H  4.158322 3.86089 -1.785277
H  2.868889 5.050137 -1.76931
H  4.303611 6.737652 0.655672
H  4.488582 5.60845 2.001533
H  5.651532 5.623288 0.671122
H  -2.899085 2.278483 -0.336317
H  -1.210195 -0.624403 1.343056
H  -3.887116 0.663198 -1.76012
H  -3.893549 -1.633789 -2.679205
H  -2.56313 -3.406958 -1.619688
H  0.320154 -2.667421 -1.69613
H  -0.866113 -5.506092 1.294489
H  1.58901 -4.424241 -2.852922
H  0.433053 -7.259628 0.138001
H  1.656057 -6.729091 -1.950324
elementType: O N C H
totalener: -1210.09206020 hartree
nucrepener: 2479.14428219 hartree
electener: -3689.23634239 hartree
oneelecener: -6569.63417000 hartree
twoeener: 2880.39782761 hartree
cpcmener: -0.03631430 hartree
kineticenergy: 1204.69255925 hartree
xcener: -118.582032037469 hartree
chargesum: 0.0000000
charge: -0.287462 -0.462916 -0.340922 -0.101949 0.119118 0.046636 -0.087532 -0.279600 -0.275544 -0.314472 0.373282 -0.008356 -0.284498 -0.223105 0.422187 0.024852 -0.223534 -0.255624 -0.205040 0.255616 -0.129169 -0.175197 0.301895 -0.192071 -0.252613 -0.161262 -0.125303 -0.185127 0.095273 0.094391 0.090587 0.096387 0.104401 0.098461 0.099441 0.090932 0.121756 0.095905 0.104458 0.103222 0.097854 0.085406 0.097344 0.147086 0.140591 0.148354 0.164180 0.160516 0.158106 0.147967 0.162639 0.161031 0.161424
qa: -0.2875 -0.4629 -0.3409 -0.1019 0.1191 0.0466 -0.0875 -0.2796 -0.2755 -0.3145 0.3733 -0.0084 -0.2845 -0.2231 0.4222 0.0249 -0.2235 -0.2556 -0.2050 0.2556 -0.1292 -0.1752 0.3019 -0.1921 -0.2526 -0.1613 -0.1253 -0.1851 0.0953 0.0944 0.0906 0.0964 0.1044 0.0985 0.0994 0.0909 0.1218 0.0959 0.1045 0.1032 0.0979 0.0854 0.0973 0.1471 0.1406 0.1484 0.1642 0.1605 0.1581 0.1480 0.1626 0.1610 0.1614
va: 2.1099 2.0383 2.0516 3.1109 3.6898 3.7975 3.8336 3.9043 3.9103 3.9017 4.2015 3.6901 3.9403 3.9196 3.6979 3.6109 4.0825 4.0110 3.9910 3.7636 3.8909 3.9129 3.6459 3.8860 4.0113 3.9070 3.8822 3.8971 1.0258 1.0353 0.9995 1.0155 1.0019 1.0019 1.0013 1.0057 1.0088 1.0044 0.9956 0.9966 0.9927 1.0100 0.9928 1.0151 1.0258 1.0016 0.9888 0.9932 0.9961 1.0077 0.9895 0.9881 0.9891
dispcorr: -0.026327901 hartree
energy: -1210.118388101171
dipole: 33.67964 -31.87471 1.80493 13.94980 -14.45967 -0.50987 -4.40476 3.08489 -1.31987
magnitude: 2.29342 au
magnitude: 5.82941 debye
