program: Orca
programVersion: 5.0.2
elementType: O O O N C C C C C C C C C C C C C C C C C C C C C C C C H H H H H H H H H H H H H H H H H H H H H H H H H
charge: 0
multiplicity: 1
keywords: wb97x-d3
keywords: def2-TZVPP
keywords: def2/J RIJCOSX
keywords: DEFGRID2
keywords: scfconv7
keywords: smallprint printgap noloewdin
keywords: NOSOSCF
formula: C24H25NO3
InChI: InChI=1/C24H25NO3/c1-16(2)13-20-22(24(20,3)4)23(26)28-21(15-25)17-9-8-12-19(14-17)27-18-10-6-5-7-11-18/h5-14,20-22H,1-4H3
53 atoms
O  -1.175061 1.81792 1.142466
O  -0.531096 2.407716 -0.915784
O  -0.204923 -2.911742 -0.098858
N  -3.915655 0.855684 2.68664
C  2.249174 1.728407 0.50794
C  2.152649 3.187793 0.171068
C  1.015965 2.525313 0.91582
C  2.167603 0.730035 -0.620803
C  3.136787 1.266217 1.636961
C  2.950414 4.214926 0.869408
C  -0.270185 2.274691 0.253936
C  3.598617 5.242474 0.310927
C  3.63828 5.540758 -1.156521
C  4.364684 6.212053 1.160128
C  -2.402893 1.343402 0.611692
C  -2.230653 0.078893 -0.201167
C  -3.238103 1.076042 1.783888
C  -1.333412 -0.890679 0.224393
C  -2.97438 -0.105514 -1.357146
C  -1.161184 -2.038899 -0.534094
C  -2.805133 -1.269036 -2.093806
C  -1.896234 -2.237703 -1.697332
C  -0.316192 -4.251328 -0.392273
C  0.777666 -4.878041 -0.967393
C  -1.461299 -4.966164 -0.065996
C  0.726437 -6.244051 -1.211958
C  -1.502704 -6.32814 -0.325282
C  -0.41258 -6.971722 -0.897648
H  1.944387 3.381328 -0.875701
H  0.942395 2.727879 1.978838
H  1.600592 1.092593 -1.475988
H  3.174186 0.501072 -0.975408
H  1.717355 -0.20743 -0.286912
H  3.14061 1.949927 2.484368
H  2.806478 0.292439 2.00273
H  4.166259 1.156608 1.290654
H  3.003035 4.118237 1.949951
H  3.120838 4.808451 -1.772154
H  3.19562 6.519002 -1.360169
H  4.671861 5.595163 -1.50609
H  3.990084 7.230265 1.026305
H  4.305815 5.968228 2.220626
H  5.419838 6.232709 0.875835
H  -2.906468 2.111401 0.015375
H  -0.753114 -0.762362 1.130324
H  -3.670765 0.655212 -1.685228
H  -3.373645 -1.41802 -3.001884
H  -1.75989 -3.126592 -2.299211
H  1.662088 -4.304736 -1.214619
H  -2.309447 -4.470406 0.389557
H  1.580873 -6.736523 -1.657103
H  -2.392519 -6.889097 -0.071512
H  -0.450724 -8.034835 -1.093658
elementType: O N C H
totalener: -1210.09330705 hartree
nucrepener: 2454.14731279 hartree
electener: -3664.24061984 hartree
oneelecener: -6519.90569634 hartree
twoeener: 2855.66507650 hartree
cpcmener: -0.03662912 hartree
kineticenergy: 1204.69754436 hartree
xcener: -118.582910442766 hartree
chargesum: 0.0000000
charge: -0.283653 -0.459084 -0.340056 -0.101753 0.112719 0.036828 -0.079795 -0.277797 -0.271833 -0.287665 0.368910 -0.051067 -0.252093 -0.218007 0.424921 0.040840 -0.225465 -0.292061 -0.210382 0.289779 -0.130337 -0.187825 0.245964 -0.225400 -0.172088 -0.139886 -0.157525 -0.169528 0.094281 0.095539 0.095989 0.105700 0.091520 0.090684 0.098456 0.099244 0.122475 0.090784 0.097650 0.095474 0.093501 0.088748 0.093614 0.147224 0.142301 0.148716 0.163770 0.160260 0.150797 0.160693 0.161036 0.162589 0.162293
qa: -0.2837 -0.4591 -0.3401 -0.1018 0.1127 0.0368 -0.0798 -0.2778 -0.2718 -0.2877 0.3689 -0.0511 -0.2521 -0.2180 0.4249 0.0408 -0.2255 -0.2921 -0.2104 0.2898 -0.1303 -0.1878 0.2460 -0.2254 -0.1721 -0.1399 -0.1575 -0.1695 0.0943 0.0955 0.0960 0.1057 0.0915 0.0907 0.0985 0.0992 0.1225 0.0908 0.0976 0.0955 0.0935 0.0887 0.0936 0.1472 0.1423 0.1487 0.1638 0.1603 0.1508 0.1607 0.1610 0.1626 0.1623
va: 2.1129 2.0449 2.0388 3.1096 3.6878 3.8016 3.8042 3.9012 3.9050 3.8753 4.2173 3.7610 3.9402 3.9196 3.6944 3.5783 4.0907 4.0324 3.9921 3.7098 3.9037 3.9179 3.7131 3.9935 3.9141 3.8869 3.8913 3.8825 1.0297 1.0345 1.0147 1.0019 1.0037 1.0060 1.0018 1.0013 1.0097 1.0100 0.9962 0.9974 0.9961 1.0088 0.9965 1.0137 1.0256 1.0018 0.9892 0.9951 1.0042 0.9954 0.9889 0.9892 0.9886
dispcorr: -0.025818530 hartree
energy: -1210.119125579306
dipole: 30.43359 -29.10392 1.32967 17.63022 -18.08443 -0.45421 -3.57732 2.36966 -1.20766
magnitude: 1.85278 au
magnitude: 4.70938 debye
