program: Orca
programVersion: 5.0.2
elementType: O O O N C C C C C C C C C C C C C C C C C C C C C C C C H H H H H H H H H H H H H H H H H H H H H H H H H
charge: 0
multiplicity: 1
keywords: wb97x-d3
keywords: def2-TZVPP
keywords: def2/J RIJCOSX
keywords: DEFGRID2
keywords: scfconv7
keywords: smallprint printgap noloewdin
keywords: NOSOSCF
formula: C24H25NO3
InChI: InChI=1/C24H25NO3/c1-16(2)13-20-22(24(20,3)4)23(26)28-21(15-25)17-9-8-12-19(14-17)27-18-10-6-5-7-11-18/h5-14,20-22H,1-4H3
53 atoms
O  -1.120089 1.863174 1.045223
O  -0.47325 2.070041 -1.084312
O  -0.843657 -3.091884 0.44711
N  -3.961901 1.561627 2.700024
C  2.253336 1.214833 0.35765
C  2.320809 2.60713 -0.172404
C  1.141694 2.211083 0.683734
C  1.999601 0.074974 -0.597787
C  3.123642 0.827786 1.527754
C  3.308232 3.594486 0.33834
C  -0.189298 2.059104 0.087939
C  3.057592 4.88585 0.569127
C  1.719801 5.522804 0.350454
C  4.123275 5.809236 1.075558
C  -2.414836 1.502419 0.594553
C  -2.454816 0.117969 -0.01515
C  -3.26415 1.544571 1.785771
C  -1.623455 -0.878754 0.478285
C  -3.321407 -0.141598 -1.065747
C  -1.662107 -2.138802 -0.09647
C  -3.363401 -1.415066 -1.615579
C  -2.53793 -2.420453 -1.138734
C  -0.188176 -3.97455 -0.376624
C  0.383479 -3.577096 -1.579522
C  -0.068978 -5.282589 0.070002
C  1.070711 -4.511692 -2.341118
C  0.631386 -6.202746 -0.697093
C  1.197721 -5.824913 -1.906947
H  2.085974 2.692895 -1.231256
H  1.137368 2.562586 1.709394
H  1.478868 -0.746401 -0.101737
H  1.419411 0.366491 -1.470667
H  2.952125 -0.315143 -0.95973
H  2.680559 -0.008465 2.071122
H  4.109739 0.510979 1.182419
H  3.263654 1.645409 2.234418
H  4.314613 3.224062 0.514134
H  0.990036 4.853646 -0.101378
H  1.305841 5.886297 1.294579
H  1.816547 6.396864 -0.29818
H  3.819195 6.275471 2.016203
H  5.068986 5.294507 1.243585
H  4.301206 6.625418 0.370978
H  -2.811734 2.236455 -0.114853
H  -0.939142 -0.690289 1.296483
H  -3.957033 0.64388 -1.45422
H  -4.043082 -1.627529 -2.429541
H  -2.580367 -3.409231 -1.576727
H  0.301751 -2.553171 -1.923124
H  -0.514854 -5.574513 1.012494
H  1.512873 -4.205326 -3.280101
H  0.727758 -7.221711 -0.345826
H  1.735137 -6.54731 -2.506431
elementType: O N C H
totalener: -1210.09168899 hartree
nucrepener: 2506.22675878 hartree
electener: -3716.31844777 hartree
oneelecener: -6623.77608416 hartree
twoeener: 2907.45763638 hartree
cpcmener: -0.03532924 hartree
kineticenergy: 1204.69653571 hartree
xcener: -118.582717403852 hartree
chargesum: -0.0000000
charge: -0.287747 -0.463538 -0.342425 -0.101979 0.173397 -0.002283 -0.124198 -0.289436 -0.286999 -0.309297 0.380104 -0.016497 -0.236776 -0.230068 0.418769 0.026788 -0.222586 -0.259939 -0.203206 0.246865 -0.129577 -0.169780 0.301437 -0.189001 -0.253016 -0.165862 -0.127389 -0.182586 0.106520 0.102175 0.087591 0.098306 0.106114 0.099496 0.100820 0.094981 0.125340 0.080099 0.100352 0.102113 0.095143 0.090142 0.097500 0.147280 0.144727 0.149489 0.164229 0.160884 0.159621 0.148770 0.162438 0.161238 0.161455
qa: -0.2877 -0.4635 -0.3424 -0.1020 0.1734 -0.0023 -0.1242 -0.2894 -0.2870 -0.3093 0.3801 -0.0165 -0.2368 -0.2301 0.4188 0.0268 -0.2226 -0.2599 -0.2032 0.2469 -0.1296 -0.1698 0.3014 -0.1890 -0.2530 -0.1659 -0.1274 -0.1826 0.1065 0.1022 0.0876 0.0983 0.1061 0.0995 0.1008 0.0950 0.1253 0.0801 0.1004 0.1021 0.0951 0.0901 0.0975 0.1473 0.1447 0.1495 0.1642 0.1609 0.1596 0.1488 0.1624 0.1612 0.1615
va: 2.1075 2.0347 2.0459 3.1107 3.6966 3.8216 3.8312 3.8894 3.9017 3.8931 4.1595 3.7128 3.9308 3.9299 3.6982 3.6035 4.0832 4.0130 3.9914 3.7699 3.8906 3.9123 3.6370 3.8830 4.0149 3.9141 3.8846 3.8959 1.0229 1.0282 1.0015 1.0130 1.0032 1.0035 0.9997 1.0021 1.0028 1.0151 0.9986 0.9995 0.9967 1.0061 0.9960 1.0150 1.0228 1.0012 0.9886 0.9932 0.9947 1.0074 0.9899 0.9881 0.9890
dispcorr: -0.027724253 hartree
energy: -1210.119413246960
dipole: 28.32067 -26.81029 1.51038 15.39206 -15.68836 -0.29630 -2.47745 1.18620 -1.29125
magnitude: 2.00907 au
magnitude: 5.10666 debye
