program: Orca
programVersion: 5.0.2
elementType: O O O N C C C C C C C C C C C C C C C C C C C C C C C C H H H H H H H H H H H H H H H H H H H H H H H H H
charge: 0
multiplicity: 1
keywords: wb97x-d3
keywords: def2-TZVPP
keywords: def2/J RIJCOSX
keywords: DEFGRID2
keywords: scfconv7
keywords: smallprint printgap noloewdin
keywords: NOSOSCF
formula: C24H25NO3
InChI: InChI=1/C24H25NO3/c1-16(2)13-20-22(24(20,3)4)23(26)28-21(15-25)17-9-8-12-19(14-17)27-18-10-6-5-7-11-18/h5-14,20-22H,1-4H3
53 atoms
O  -0.33132 0.719613 1.399565
O  -0.887081 2.446828 0.0957
O  -1.446959 -2.957651 -2.086191
N  -1.840827 -1.351173 3.463882
C  2.142521 2.128885 -0.767789
C  1.986855 3.319196 0.1266
C  1.420132 1.980535 0.56366
C  1.371154 2.103314 -2.064249
C  3.474082 1.424363 -0.863819
C  3.106988 3.897486 0.894178
C  -0.032516 1.784922 0.631777
C  3.371017 5.197773 1.061711
C  2.565732 6.321648 0.484061
C  4.542918 5.638549 1.886849
C  -1.707552 0.378916 1.509182
C  -2.252325 -0.25423 0.250168
C  -1.766802 -0.583887 2.610505
C  -1.572237 -1.32551 -0.316391
C  -3.41878 0.228665 -0.322103
C  -2.082443 -1.920825 -1.459906
C  -3.911521 -0.3731 -1.471748
C  -3.252256 -1.449094 -2.042681
C  -0.776603 -3.893184 -1.33162
C  -1.370642 -4.496367 -0.229998
C  0.494381 -4.259295 -1.745758
C  -0.672938 -5.476016 0.460791
C  1.176182 -5.250176 -1.05173
C  0.59913 -5.858169 0.054124
H  1.234078 4.023208 -0.210934
H  1.980468 1.445364 1.321874
H  2.000352 2.494892 -2.865576
H  1.092892 1.082867 -2.334959
H  0.466153 2.706193 -2.041784
H  4.125981 1.938984 -1.572328
H  3.996844 1.366364 0.089606
H  3.335516 0.403546 -1.224009
H  3.770456 3.185801 1.376808
H  3.21891 7.031165 -0.031755
H  1.802486 6.002133 -0.224361
H  2.067946 6.884976 1.279449
H  4.222088 6.288296 2.705313
H  5.085732 4.797084 2.316634
H  5.245222 6.223383 1.287212
H  -2.310933 1.247481 1.792756
H  -0.655943 -1.691177 0.132289
H  -3.938473 1.066355 0.124137
H  -4.820488 -0.003501 -1.926737
H  -3.639068 -1.923139 -2.93559
H  -2.366565 -4.213303 0.087316
H  0.943002 -3.778354 -2.605621
H  -1.132994 -5.947343 1.31931
H  2.167122 -5.539462 -1.376035
H  1.135572 -6.625559 0.595821
elementType: O N C H
totalener: -1210.09410023 hartree
nucrepener: 2469.10203275 hartree
electener: -3679.19613298 hartree
oneelecener: -6549.93003780 hartree
twoeener: 2870.73390482 hartree
cpcmener: -0.03606864 hartree
kineticenergy: 1204.69316310 hartree
xcener: -118.581573668902 hartree
chargesum: -0.0000000
charge: -0.290056 -0.470926 -0.340660 -0.103145 0.101546 0.041863 -0.088628 -0.272187 -0.271972 -0.285085 0.396846 -0.045735 -0.255280 -0.219079 0.441956 0.018466 -0.226233 -0.198215 -0.209320 0.235821 -0.114923 -0.232300 0.267192 -0.179481 -0.240902 -0.147679 -0.129039 -0.181758 0.094136 0.092557 0.099703 0.098944 0.091520 0.098872 0.090477 0.098516 0.121439 0.094342 0.091194 0.100007 0.093477 0.088887 0.094620 0.145036 0.148339 0.149734 0.162612 0.151765 0.158041 0.149483 0.162257 0.161208 0.161745
qa: -0.2901 -0.4709 -0.3407 -0.1031 0.1015 0.0419 -0.0886 -0.2722 -0.2720 -0.2851 0.3968 -0.0457 -0.2553 -0.2191 0.4420 0.0185 -0.2262 -0.1982 -0.2093 0.2358 -0.1149 -0.2323 0.2672 -0.1795 -0.2409 -0.1477 -0.1290 -0.1818 0.0941 0.0926 0.0997 0.0989 0.0915 0.0989 0.0905 0.0985 0.1214 0.0943 0.0912 0.1000 0.0935 0.0889 0.0946 0.1450 0.1483 0.1497 0.1626 0.1518 0.1580 0.1495 0.1623 0.1612 0.1617
va: 2.1242 2.0383 2.0620 3.1077 3.7019 3.7828 3.8316 3.9039 3.9098 3.8809 4.1775 3.7551 3.9407 3.9204 3.6957 3.5831 4.0891 3.9154 3.9673 3.7540 3.8966 4.0047 3.6913 3.9061 4.0059 3.8867 3.8779 3.8937 1.0304 1.0356 1.0003 0.9994 1.0171 1.0013 1.0061 1.0019 1.0106 0.9975 1.0091 0.9956 0.9957 1.0089 0.9962 1.0154 1.0165 1.0029 0.9879 1.0037 0.9965 1.0064 0.9892 0.9882 0.9891
dispcorr: -0.025102339 hartree
energy: -1210.119202573010
dipole: 27.05193 -26.09614 0.95579 26.43451 -25.64520 0.78931 -4.38493 3.53610 -0.84883
magnitude: 1.50235 au
magnitude: 3.81868 debye
