program: Orca
programVersion: 5.0.2
elementType: O O O N C C C C C C C C C C C C C C C C C C C C C C C C H H H H H H H H H H H H H H H H H H H H H H H H H
charge: 0
multiplicity: 1
keywords: wb97x-d3
keywords: def2-TZVPP
keywords: def2/J RIJCOSX
keywords: DEFGRID2
keywords: scfconv7
keywords: smallprint printgap noloewdin
keywords: NOSOSCF
formula: C24H25NO3
InChI: InChI=1/C24H25NO3/c1-16(2)13-20-22(24(20,3)4)23(26)28-21(15-25)17-9-8-12-19(14-17)27-18-10-6-5-7-11-18/h5-14,20-22H,1-4H3
53 atoms
O  -1.108771 1.373526 -0.3605
O  -1.025259 3.39123 0.590174
O  -1.451309 -3.68613 -0.168753
N  -2.277535 1.184725 2.8388
C  1.688897 3.750364 -0.958445
C  2.005936 2.994721 0.284253
C  0.869088 2.52097 -0.616914
C  1.098662 5.135135 -0.851704
C  2.590359 3.583536 -2.158626
C  3.212972 2.13993 0.421987
C  -0.490065 2.534657 -0.072162
C  3.227978 0.921972 0.97091
C  2.010712 0.242588 1.522685
C  4.490739 0.120585 1.051669
C  -2.376028 1.117574 0.222224
C  -2.776765 -0.269697 -0.210371
C  -2.295513 1.178927 1.688253
C  -1.911484 -1.327398 0.048241
C  -3.973547 -0.476211 -0.876392
C  -2.24599 -2.596866 -0.39448
C  -4.307003 -1.760474 -1.288126
C  -3.446356 -2.820235 -1.060442
C  -0.084408 -3.53424 -0.109547
C  0.613679 -2.827382 -1.081425
C  0.582673 -4.167516 0.927519
C  1.996453 -2.752728 -0.998941
C  1.968004 -4.095725 0.98967
C  2.678729 -3.384623 0.033543
H  1.661943 3.474376 1.198265
H  1.093545 1.640445 -1.207322
H  0.412956 5.335445 -1.676887
H  0.565987 5.304852 0.08108
H  1.900971 5.873463 -0.906742
H  2.050475 3.821836 -3.076551
H  3.44443 4.260126 -2.091731
H  2.975508 2.568355 -2.254898
H  4.145932 2.553992 0.049265
H  2.239567 -0.22853 2.480975
H  1.168888 0.914474 1.679074
H  1.681568 -0.560993 0.856915
H  4.368403 -0.844269 0.551682
H  5.335509 0.634226 0.59339
H  4.749239 -0.102369 2.089656
H  -3.12089 1.8513 -0.100664
H  -0.985854 -1.156354 0.58645
H  -4.638225 0.354162 -1.075286
H  -5.239367 -1.933845 -1.808162
H  -3.699425 -3.817618 -1.39623
H  0.092042 -2.341431 -1.896328
H  0.023959 -4.716767 1.674411
H  2.542317 -2.199091 -1.751649
H  2.489554 -4.594167 1.795969
H  3.757447 -3.324603 0.089281
elementType: O N C H
totalener: -1210.09153355 hartree
nucrepener: 2576.80455870 hartree
electener: -3786.89609225 hartree
oneelecener: -6764.85916166 hartree
twoeener: 2977.96306941 hartree
cpcmener: -0.03761922 hartree
kineticenergy: 1204.69864889 hartree
xcener: -118.583720372518 hartree
chargesum: 0.0000000
charge: -0.279690 -0.472135 -0.338482 -0.099844 0.163124 0.003378 -0.117231 -0.288371 -0.285414 -0.308290 0.389833 -0.002765 -0.222966 -0.224961 0.434814 0.004352 -0.237360 -0.203906 -0.203343 0.249657 -0.108691 -0.240956 0.260723 -0.160184 -0.237911 -0.147492 -0.113346 -0.208951 0.112821 0.093461 0.101989 0.091988 0.095142 0.098481 0.100349 0.094556 0.124240 0.110148 0.083101 0.064834 0.085338 0.092797 0.098883 0.133333 0.156275 0.150255 0.162393 0.149791 0.157807 0.149293 0.159950 0.161394 0.167791
qa: -0.2797 -0.4721 -0.3385 -0.0998 0.1631 0.0034 -0.1172 -0.2884 -0.2854 -0.3083 0.3898 -0.0028 -0.2230 -0.2250 0.4348 0.0044 -0.2374 -0.2039 -0.2033 0.2497 -0.1087 -0.2410 0.2607 -0.1602 -0.2379 -0.1475 -0.1133 -0.2090 0.1128 0.0935 0.1020 0.0920 0.0951 0.0985 0.1003 0.0946 0.1242 0.1101 0.0831 0.0648 0.0853 0.0928 0.0989 0.1333 0.1563 0.1503 0.1624 0.1498 0.1578 0.1493 0.1600 0.1614 0.1678
va: 2.1439 2.0261 2.0692 3.1046 3.7030 3.8053 3.8501 3.8869 3.9075 3.8991 4.1391 3.6858 3.9409 3.9321 3.7471 3.7043 4.0351 3.9458 3.9432 3.7791 3.8916 4.0078 3.6923 3.8745 4.0101 3.8165 3.8604 3.8622 1.0187 1.0295 0.9987 1.0185 1.0007 1.0030 1.0000 1.0018 1.0034 1.0014 1.0157 1.0124 1.0004 1.0077 0.9969 1.0150 1.0029 1.0013 0.9880 1.0050 0.9955 1.0059 0.9919 0.9880 0.9847
dispcorr: -0.029716771 hartree
energy: -1210.121250316565
dipole: 27.05845 -26.06269 0.99577 11.91171 -12.62459 -0.71288 -5.46838 3.02569 -2.44270
magnitude: 2.73249 au
magnitude: 6.94544 debye
