program: Orca
programVersion: 5.0.2
elementType: O O O N C C C C C C C C C C C C C C C C C C C C C C C C H H H H H H H H H H H H H H H H H H H H H H H H H
charge: 0
multiplicity: 1
keywords: wb97x-d3
keywords: def2-TZVPP
keywords: def2/J RIJCOSX
keywords: DEFGRID2
keywords: scfconv7
keywords: smallprint printgap noloewdin
keywords: NOSOSCF
formula: C24H25NO3
InChI: InChI=1/C24H25NO3/c1-16(2)13-20-22(24(20,3)4)23(26)28-21(15-25)17-9-8-12-19(14-17)27-18-10-6-5-7-11-18/h5-14,20-22H,1-4H3
53 atoms
O  -1.129656 1.348623 -0.417271
O  -1.044727 3.407735 0.436699
O  -1.377881 -3.66124 -0.032876
N  -2.364548 1.352969 2.76196
C  1.755705 3.633852 -0.973092
C  1.980775 2.925823 0.31735
C  0.886519 2.440208 -0.629301
C  1.195973 5.035018 -0.961374
C  2.722473 3.393321 -2.108413
C  3.16151 2.059614 0.565934
C  -0.498919 2.510161 -0.158931
C  3.123222 0.848357 1.128881
C  1.86072 0.178144 1.583289
C  4.37223 0.047349 1.332922
C  -2.408861 1.129299 0.152443
C  -2.798418 -0.288778 -0.183612
C  -2.3619 1.28652 1.612987
C  -1.892776 -1.310351 0.078286
C  -4.034976 -0.562456 -0.745655
C  -2.224419 -2.611523 -0.261923
C  -4.365752 -1.877497 -1.047308
C  -3.464206 -2.903422 -0.818845
C  -0.018838 -3.466885 -0.135301
C  0.54354 -2.795776 -1.21476
C  0.780893 -4.016551 0.854729
C  1.923074 -2.672475 -1.289577
C  2.161138 -3.898113 0.759091
C  2.737381 -3.223274 -0.307855
H  1.596992 3.454415 1.187492
H  1.120095 1.529292 -1.167954
H  0.564838 5.213385 -1.833614
H  0.614824 5.258731 -0.070213
H  2.018218 5.7517 -1.001603
H  3.087238 2.366515 -2.136651
H  2.244874 3.602081 -3.067129
H  3.587826 4.05262 -2.019165
H  4.126278 2.464744 0.272142
H  2.013709 -0.302718 2.551744
H  1.018126 0.859414 1.68428
H  1.572912 -0.616824 0.888213
H  4.289184 -0.929705 0.849157
H  5.254202 0.548481 0.934853
H  4.54199 -0.149519 2.394327
H  -3.148892 1.834802 -0.237444
H  -0.936843 -1.09057 0.539695
H  -4.732096 0.239912 -0.948831
H  -5.329298 -2.103076 -1.483734
H  -3.715803 -3.925271 -1.072084
H  -0.080696 -2.373662 -1.992344
H  0.328573 -4.53862 1.688258
H  2.362009 -2.147385 -2.127771
H  2.785307 -4.333008 1.52861
H  3.812792 -3.127937 -0.376447
elementType: O N C H
totalener: -1210.09110752 hartree
nucrepener: 2587.55024099 hartree
electener: -3797.64134851 hartree
oneelecener: -6786.33407852 hartree
twoeener: 2988.69273001 hartree
cpcmener: -0.03749164 hartree
kineticenergy: 1204.69542278 hartree
xcener: -118.583673966975 hartree
chargesum: -0.0000000
charge: -0.280959 -0.470283 -0.339388 -0.100520 0.162748 0.006562 -0.117212 -0.288616 -0.284644 -0.309123 0.387892 -0.004447 -0.209933 -0.230454 0.431000 0.003198 -0.236220 -0.191867 -0.206009 0.242780 -0.108819 -0.238943 0.257598 -0.166829 -0.225795 -0.130746 -0.121525 -0.220393 0.112386 0.093360 0.101787 0.091689 0.095147 0.094049 0.098678 0.100174 0.124078 0.110566 0.081279 0.055071 0.091900 0.091861 0.098538 0.134938 0.157027 0.149586 0.162509 0.149790 0.158258 0.148675 0.160899 0.161558 0.167144
qa: -0.2810 -0.4703 -0.3394 -0.1005 0.1627 0.0066 -0.1172 -0.2886 -0.2846 -0.3091 0.3879 -0.0044 -0.2099 -0.2305 0.4310 0.0032 -0.2362 -0.1919 -0.2060 0.2428 -0.1088 -0.2389 0.2576 -0.1668 -0.2258 -0.1307 -0.1215 -0.2204 0.1124 0.0934 0.1018 0.0917 0.0951 0.0940 0.0987 0.1002 0.1241 0.1106 0.0813 0.0551 0.0919 0.0919 0.0985 0.1349 0.1570 0.1496 0.1625 0.1498 0.1583 0.1487 0.1609 0.1616 0.1671
va: 2.1398 2.0273 2.0681 3.1042 3.7033 3.7980 3.8510 3.8873 3.9064 3.8947 4.1471 3.6858 3.9410 3.9313 3.7491 3.7068 4.0359 3.9388 3.9487 3.7846 3.8898 4.0067 3.6938 3.8819 3.9947 3.8190 3.8526 3.8723 1.0191 1.0280 0.9988 1.0187 1.0007 1.0025 1.0030 1.0002 1.0035 1.0023 1.0154 1.0151 0.9995 1.0076 0.9967 1.0144 1.0011 1.0017 0.9879 1.0049 0.9952 1.0057 0.9910 0.9885 0.9856
dispcorr: -0.030175005 hartree
energy: -1210.121282520991
dipole: 27.07774 -26.06561 1.01213 10.94935 -11.80175 -0.85240 -4.94073 2.55267 -2.38806
magnitude: 2.73017 au
magnitude: 6.93953 debye
