program: Orca
programVersion: 5.0.2
elementType: O O O N C C C C C C C C C C C C C C C C C C C C C C C C H H H H H H H H H H H H H H H H H H H H H H H H H
charge: 0
multiplicity: 1
keywords: wb97x-d3
keywords: def2-TZVPP
keywords: def2/J RIJCOSX
keywords: DEFGRID2
keywords: scfconv7
keywords: smallprint printgap noloewdin
keywords: NOSOSCF
formula: C24H25NO3
InChI: InChI=1/C24H25NO3/c1-16(2)13-20-22(24(20,3)4)23(26)28-21(15-25)17-9-8-12-19(14-17)27-18-10-6-5-7-11-18/h5-14,20-22H,1-4H3
53 atoms
O  -0.936376 1.733781 1.221193
O  -0.592075 2.406281 -0.883375
O  -0.022156 -2.822837 -0.462506
N  -3.481919 0.749498 3.076073
C  2.376691 1.692876 0.029409
C  2.210601 3.160931 -0.16534
C  1.212148 2.424181 0.69714
C  2.133796 0.765315 -1.135406
C  3.438768 1.189755 0.97579
C  3.135946 4.14654 0.452523
C  -0.16162 2.21888 0.228156
C  2.777847 5.343994 0.922305
C  1.368575 5.849755 0.90738
C  3.785632 6.280741 1.514501
C  -2.22776 1.283311 0.846827
C  -2.174849 0.04182 -0.018284
C  -2.91371 0.992435 2.106229
C  -1.170017 -0.89483 0.179447
C  -3.130994 -0.147514 -1.005172
C  -1.099889 -2.004489 -0.649705
C  -3.063426 -1.277228 -1.807899
C  -2.045726 -2.20549 -1.64892
C  -0.101876 -4.166498 -0.735949
C  0.975791 -4.74077 -1.393794
C  -1.175485 -4.941161 -0.314975
C  0.979125 -6.108382 -1.630667
C  -1.164051 -6.304987 -0.570272
C  -0.091319 -6.894425 -1.227098
H  1.820602 3.440742 -1.141489
H  1.309157 2.541608 1.770567
H  1.420152 1.156723 -1.857253
H  3.072118 0.599866 -1.66769
H  1.774948 -0.209264 -0.797889
H  4.399566 1.108235 0.463642
H  3.573904 1.841174 1.838646
H  3.178995 0.196893 1.346617
H  4.184562 3.865817 0.497642
H  0.673154 5.176613 0.408943
H  1.00716 6.013166 1.926167
H  1.314706 6.818606 0.405028
H  3.52001 6.539436 2.542688
H  4.788726 5.854887 1.522063
H  3.820737 7.221471 0.959528
H  -2.798084 2.069436 0.341207
H  -0.42309 -0.767486 0.953626
H  -3.912412 0.585946 -1.157036
H  -3.798061 -1.42768 -2.587342
H  -1.991666 -3.062656 -2.30711
H  1.807489 -4.123648 -1.709803
H  -2.011336 -4.494709 0.20905
H  1.822769 -6.556782 -2.138933
H  -2.000864 -6.909755 -0.246128
H  -0.088542 -7.959058 -1.4185
elementType: O N C H
totalener: -1210.09166888 hartree
nucrepener: 2476.17911824 hartree
electener: -3686.27078712 hartree
oneelecener: -6563.92029361 hartree
twoeener: 2877.64950649 hartree
cpcmener: -0.03522839 hartree
kineticenergy: 1204.69242369 hartree
xcener: -118.582093249593 hartree
chargesum: -0.0000000
charge: -0.288678 -0.465142 -0.336901 -0.101883 0.159321 -0.008967 -0.108588 -0.279056 -0.287754 -0.301315 0.375759 -0.016938 -0.240110 -0.228489 0.424569 0.038853 -0.225456 -0.288765 -0.213957 0.301633 -0.122918 -0.201204 0.273718 -0.243829 -0.191707 -0.131515 -0.152174 -0.180117 0.106502 0.099630 0.095523 0.105142 0.089712 0.100992 0.095335 0.098552 0.125223 0.080187 0.100229 0.101807 0.094550 0.089857 0.096882 0.147297 0.142963 0.149178 0.163673 0.160733 0.151010 0.160494 0.161207 0.162864 0.162072
qa: -0.2887 -0.4651 -0.3369 -0.1019 0.1593 -0.0090 -0.1086 -0.2791 -0.2878 -0.3013 0.3758 -0.0169 -0.2401 -0.2285 0.4246 0.0389 -0.2255 -0.2888 -0.2140 0.3016 -0.1229 -0.2012 0.2737 -0.2438 -0.1917 -0.1315 -0.1522 -0.1801 0.1065 0.0996 0.0955 0.1051 0.0897 0.1010 0.0953 0.0986 0.1252 0.0802 0.1002 0.1018 0.0946 0.0899 0.0969 0.1473 0.1430 0.1492 0.1637 0.1607 0.1510 0.1605 0.1612 0.1629 0.1621
va: 2.1057 2.0334 2.0470 3.1108 3.6959 3.8281 3.8184 3.8876 3.9056 3.8911 4.1623 3.7099 3.9339 3.9296 3.6930 3.5901 4.0863 4.0386 4.0005 3.6995 3.8969 3.9387 3.6929 3.9961 3.9151 3.8838 3.8899 3.8908 1.0235 1.0295 1.0144 1.0028 1.0059 0.9995 1.0016 1.0038 1.0024 1.0150 0.9985 0.9995 0.9965 1.0062 0.9962 1.0144 1.0247 1.0014 0.9888 0.9941 1.0047 0.9960 0.9887 0.9890 0.9889
dispcorr: -0.026727499 hartree
energy: -1210.118396380043
dipole: 24.80961 -23.76868 1.04094 18.35782 -18.64121 -0.28339 -1.58134 0.46392 -1.11742
magnitude: 1.55322 au
magnitude: 3.94797 debye
