program: Orca
programVersion: 5.0.2
elementType: O O O N C C C C C C C C C C C C C C C C C C C C C C C C H H H H H H H H H H H H H H H H H H H H H H H H H
charge: 0
multiplicity: 1
keywords: wb97x-d3
keywords: def2-TZVPP
keywords: def2/J RIJCOSX
keywords: DEFGRID2
keywords: scfconv7
keywords: smallprint printgap noloewdin
keywords: NOSOSCF
formula: C24H25NO3
InChI: InChI=1/C24H25NO3/c1-16(2)13-20-22(24(20,3)4)23(26)28-21(15-25)17-9-8-12-19(14-17)27-18-10-6-5-7-11-18/h5-14,20-22H,1-4H3
53 atoms
O  -0.808819 0.840448 1.374702
O  -0.714698 1.973236 -0.548646
O  -1.866087 -3.407758 -1.311313
N  -3.108403 -0.016092 3.576832
C  2.274878 0.941363 -0.473472
C  2.218912 2.386695 -0.099085
C  1.305464 1.395563 0.609673
C  1.76263 0.531806 -1.832502
C  3.411822 0.069248 0.004098
C  3.275021 3.065657 0.674923
C  -0.141057 1.459584 0.380135
C  3.500719 4.383135 0.725467
C  2.699184 5.4233 0.004868
C  4.624326 4.93061 1.553373
C  -2.220444 0.791988 1.254733
C  -2.702436 -0.1657 0.186916
C  -2.697278 0.342629 2.564357
C  -2.001061 -1.342109 -0.052979
C  -3.864539 0.127694 -0.50687
C  -2.480115 -2.227424 -1.00845
C  -4.336128 -0.775789 -1.450531
C  -3.650403 -1.948635 -1.708519
C  -0.603057 -3.645675 -0.806467
C  0.501975 -3.224309 -1.529136
C  -0.462365 -4.326619 0.391958
C  1.772662 -3.495116 -1.040524
C  0.813599 -4.591034 0.871341
C  1.931239 -4.17471 0.159883
H  1.700857 3.005188 -0.823952
H  1.58879 1.113549 1.617127
H  2.597953 0.480417 -2.533081
H  1.305816 -0.459014 -1.795102
H  1.035129 1.225526 -2.248052
H  3.722204 0.288321 1.024567
H  3.116279 -0.98126 -0.027542
H  4.281778 0.18726 -0.644546
H  3.921602 2.425919 1.267398
H  2.268446 6.130001 0.718733
H  3.338769 6.010748 -0.658516
H  1.882683 5.020765 -0.591032
H  4.254003 5.643718 2.294185
H  5.167282 4.146937 2.080928
H  5.338853 5.476111 0.931525
H  -2.639794 1.788881 1.079845
H  -1.098818 -1.561226 0.50338
H  -4.397844 1.050021 -0.315168
H  -5.242172 -0.557629 -1.999604
H  -4.013549 -2.647962 -2.450735
H  0.370791 -2.696692 -2.465351
H  -1.337809 -4.64544 0.943277
H  2.639599 -3.172243 -1.601821
H  0.931558 -5.121805 1.806548
H  2.923257 -4.382487 0.53801
elementType: O N C H
totalener: -1210.09358929 hartree
nucrepener: 2539.93707478 hartree
electener: -3750.03066407 hartree
oneelecener: -6691.27994664 hartree
twoeener: 2941.24928257 hartree
cpcmener: -0.03662116 hartree
kineticenergy: 1204.69949653 hartree
xcener: -118.584651353010 hartree
chargesum: -0.0000000
charge: -0.293525 -0.471474 -0.341491 -0.101465 0.128110 -0.009315 -0.063114 -0.265623 -0.287535 -0.271914 0.393505 -0.040211 -0.253869 -0.222395 0.410776 -0.004607 -0.222341 -0.209570 -0.226746 0.299406 -0.106212 -0.239655 0.251177 -0.180638 -0.180582 -0.195979 -0.156187 -0.137325 0.103309 0.094332 0.103262 0.082654 0.095672 0.095443 0.090559 0.103396 0.119837 0.096440 0.096392 0.089644 0.092838 0.088882 0.094793 0.150171 0.136667 0.147057 0.160928 0.148958 0.159597 0.152212 0.168751 0.162765 0.164242
qa: -0.2935 -0.4715 -0.3415 -0.1015 0.1281 -0.0093 -0.0631 -0.2656 -0.2875 -0.2719 0.3935 -0.0402 -0.2539 -0.2224 0.4108 -0.0046 -0.2223 -0.2096 -0.2267 0.2994 -0.1062 -0.2397 0.2512 -0.1806 -0.1806 -0.1960 -0.1562 -0.1373 0.1033 0.0943 0.1033 0.0827 0.0957 0.0954 0.0906 0.1034 0.1198 0.0964 0.0964 0.0896 0.0928 0.0889 0.0948 0.1502 0.1367 0.1471 0.1609 0.1490 0.1596 0.1522 0.1688 0.1628 0.1642
va: 2.1115 2.0365 2.0742 3.1113 3.6898 3.8408 3.7828 3.8920 3.9192 3.8984 4.1736 3.7537 3.9391 3.9222 3.7085 3.6700 4.0832 3.9116 3.9942 3.7232 3.8926 3.9985 3.6925 3.9303 3.9591 3.8621 3.8935 3.8489 1.0208 1.0339 1.0013 1.0062 1.0201 1.0077 1.0067 0.9998 1.0112 0.9969 0.9967 1.0123 0.9966 1.0083 0.9953 1.0159 1.0294 1.0018 0.9878 1.0066 0.9952 1.0010 0.9852 0.9884 0.9877
dispcorr: -0.027720479 hartree
energy: -1210.121309765897
dipole: 31.79491 -29.97612 1.81879 19.20679 -18.84183 0.36496 -4.72115 3.80491 -0.91625
magnitude: 2.06898 au
magnitude: 5.25893 debye
