program: Orca
programVersion: 5.0.2
elementType: O O O N C C C C C C C C C C C C C C C C C C C C C C C C H H H H H H H H H H H H H H H H H H H H H H H H H
charge: 0
multiplicity: 1
keywords: wb97x-d3
keywords: def2-TZVPP
keywords: def2/J RIJCOSX
keywords: DEFGRID2
keywords: scfconv7
keywords: smallprint printgap noloewdin
keywords: NOSOSCF
formula: C24H25NO3
InChI: InChI=1/C24H25NO3/c1-16(2)13-20-22(24(20,3)4)23(26)28-21(15-25)17-9-8-12-19(14-17)27-18-10-6-5-7-11-18/h5-14,20-22H,1-4H3
53 atoms
O  -1.408418 2.180294 -0.064196
O  -1.305037 1.935923 -2.278026
O  -0.983016 -2.759193 1.05117
N  -3.723836 2.274976 2.268345
C  1.346828 3.402258 -0.089739
C  1.516743 1.91916 0.013524
C  0.674074 2.513356 -1.118485
C  0.56368 4.121327 0.983795
C  2.480884 4.245144 -0.6260
C  2.770171 1.21795 -0.321337
C  -0.754327 2.197512 -1.234388
C  3.298115 0.180389 0.339009
C  2.698749 -0.458419 1.554835
C  4.600531 -0.419603 -0.097613
C  -2.728462 1.657329 -0.068303
C  -2.730207 0.158286 -0.254327
C  -3.273829 2.013123 1.242906
C  -1.852396 -0.619727 0.492896
C  -3.577767 -0.430565 -1.18014
C  -1.833483 -1.987785 0.294755
C  -3.553342 -1.807666 -1.357071
C  -2.676413 -2.593372 -0.626338
C  0.227939 -3.113324 0.517248
C  0.72649 -2.589295 -0.669402
C  0.967024 -4.03969 1.245956
C  1.97142 -3.009591 -1.123528
C  2.207208 -4.444955 0.779454
C  2.717305 -3.934815 -0.408705
H  0.931258 1.469673 0.807622
H  1.151621 2.514633 -2.091915
H  -0.112498 3.476107 1.538064
H  1.262405 4.549487 1.704737
H  -0.01568 4.945507 0.563819
H  2.991668 3.789107 -1.472719
H  2.105448 5.215812 -0.954214
H  3.222183 4.424735 0.154789
H  3.310831 1.592142 -1.185596
H  1.66496 -0.17273 1.74098
H  2.734153 -1.546995 1.473768
H  3.277731 -0.199038 2.445535
H  5.021293 0.089878 -0.964177
H  5.338235 -0.381254 0.70841
H  4.478346 -1.47617 -0.350577
H  -3.352766 2.139159 -0.82747
H  -1.183658 -0.173171 1.220207
H  -4.253542 0.181843 -1.763326
H  -4.21407 -2.270452 -2.077552
H  -2.646424 -3.666268 -0.767011
H  0.169224 -1.860365 -1.243267
H  0.568172 -4.438717 2.170215
H  2.357779 -2.598673 -2.047182
H  2.77621 -5.167878 1.349707
H  3.68468 -4.255804 -0.771681
elementType: O N C H
totalener: -1210.09140794 hartree
nucrepener: 2614.95890439 hartree
electener: -3825.05031233 hartree
oneelecener: -6840.96933503 hartree
twoeener: 3015.91902271 hartree
cpcmener: -0.03729073 hartree
kineticenergy: 1204.69246812 hartree
xcener: -118.584976435312 hartree
chargesum: 0.0000000
charge: -0.275177 -0.473304 -0.339934 -0.099164 0.111992 0.046558 -0.080975 -0.269312 -0.280451 -0.275184 0.392528 -0.067894 -0.263238 -0.214705 0.397580 -0.013467 -0.227466 -0.177737 -0.163671 0.170261 -0.140488 -0.141011 0.307240 -0.183622 -0.240988 -0.193820 -0.109839 -0.198552 0.106264 0.089032 0.087260 0.094428 0.101827 0.090858 0.099211 0.098501 0.120874 0.094241 0.072155 0.120175 0.090988 0.099924 0.089097 0.145159 0.156099 0.150988 0.164540 0.157610 0.147553 0.144975 0.162951 0.158188 0.160945
qa: -0.2752 -0.4733 -0.3399 -0.0992 0.1120 0.0466 -0.0810 -0.2693 -0.2805 -0.2752 0.3925 -0.0679 -0.2632 -0.2147 0.3976 -0.0135 -0.2275 -0.1777 -0.1637 0.1703 -0.1405 -0.1410 0.3072 -0.1836 -0.2410 -0.1938 -0.1098 -0.1986 0.1063 0.0890 0.0873 0.0944 0.1018 0.0909 0.0992 0.0985 0.1209 0.0942 0.0722 0.1202 0.0910 0.0999 0.0891 0.1452 0.1561 0.1510 0.1645 0.1576 0.1476 0.1450 0.1630 0.1582 0.1609
va: 2.1195 2.0282 2.0573 3.1051 3.7040 3.7562 3.8501 3.9056 3.9205 3.8437 4.1653 3.7632 3.9461 3.9071 3.7543 3.6096 4.0800 3.9872 3.9472 3.8329 3.8893 3.9636 3.6360 3.7907 3.9737 3.8589 3.8689 3.8575 1.0082 1.0311 1.0113 1.0000 1.0006 1.0068 1.0007 1.0008 1.0117 1.0056 1.0006 1.0011 1.0092 0.9956 0.9992 1.0139 1.0089 1.0003 0.9880 0.9955 1.0094 1.0097 0.9899 0.9884 0.9898
dispcorr: -0.031291181 hartree
energy: -1210.122699117922
dipole: 29.90253 -28.44865 1.45388 6.46539 -6.87658 -0.41119 0.02492 -0.96566 -0.94074
magnitude: 1.77984 au
magnitude: 4.52401 debye
