program: Orca
programVersion: 5.0.2
elementType: O O O N C C C C C C C C C C C C C C C C C C C C C C C C H H H H H H H H H H H H H H H H H H H H H H H H H
charge: 0
multiplicity: 1
keywords: wb97x-d3
keywords: def2-TZVPP
keywords: def2/J RIJCOSX
keywords: DEFGRID2
keywords: scfconv7
keywords: smallprint printgap noloewdin
keywords: NOSOSCF
formula: C24H25NO3
InChI: InChI=1/C24H25NO3/c1-16(2)13-20-22(24(20,3)4)23(26)28-21(15-25)17-9-8-12-19(14-17)27-18-10-6-5-7-11-18/h5-14,20-22H,1-4H3
53 atoms
O  -1.289374 2.269704 0.033015
O  0.455108 1.331515 -1.001151
O  -1.844902 -3.339102 -1.618302
N  -4.565773 2.351586 -0.344451
C  1.812673 2.391916 1.675333
C  2.294781 3.156576 0.480243
C  0.812202 2.991713 0.692248
C  2.030622 0.900391 1.722415
C  1.867179 3.048815 3.031555
C  2.894365 4.509041 0.601172
C  0.030052 2.114832 -0.188233
C  4.203687 4.769297 0.556769
C  5.254353 3.714899 0.393056
C  4.722827 6.16993 0.671879
C  -2.154511 1.402446 -0.68695
C  -2.091748 -0.022998 -0.188547
C  -3.497698 1.948985 -0.485223
C  -1.961371 -1.053199 -1.106318
C  -2.156314 -0.293178 1.173214
C  -1.914369 -2.365919 -0.659363
C  -2.098498 -1.609438 1.604216
C  -1.983696 -2.653385 0.697551
C  -1.098158 -4.471381 -1.395917
C  0.168412 -4.416005 -0.827575
C  -1.633738 -5.676751 -1.824812
C  0.895667 -5.588737 -0.684675
C  -0.889896 -6.840232 -1.684945
C  0.373268 -6.80316 -1.110729
H  2.707809 2.531931 -0.3065
H  0.27076 3.853328 1.068003
H  1.217193 0.400126 2.252256
H  2.120519 0.447983 0.736904
H  2.954915 0.684587 2.261517
H  1.159325 2.578123 3.715719
H  2.86465 2.943207 3.462917
H  1.633975 4.112125 2.992252
H  2.207497 5.339128 0.739425
H  5.970923 3.759918 1.216953
H  4.852637 2.703516 0.36004
H  5.829319 3.879544 -0.521956
H  3.920176 6.898456 0.784339
H  5.393624 6.269405 1.528948
H  5.307133 6.44463 -0.210117
H  -1.947733 1.438504 -1.761724
H  -1.897774 -0.839934 -2.166465
H  -2.256184 0.508087 1.894325
H  -2.153683 -1.831525 2.66131
H  -1.954281 -3.675401 1.0524
H  0.591164 -3.473258 -0.50397
H  -2.621005 -5.702494 -2.268272
H  1.882337 -5.547692 -0.242462
H  -1.306892 -7.779849 -2.022653
H  0.948073 -7.712561 -0.998541
elementType: O N C H
totalener: -1210.09275903 hartree
nucrepener: 2427.62515173 hartree
electener: -3637.71791076 hartree
oneelecener: -6466.69592383 hartree
twoeener: 2828.97801307 hartree
cpcmener: -0.03618077 hartree
kineticenergy: 1204.69718348 hartree
xcener: -118.581450796144 hartree
chargesum: 0.0000000
charge: -0.282388 -0.465543 -0.338731 -0.102257 0.150463 -0.006296 -0.117180 -0.294063 -0.270006 -0.273545 0.390144 -0.031570 -0.251080 -0.229263 0.418380 0.030042 -0.220189 -0.235227 -0.241903 0.263333 -0.134561 -0.170405 0.275285 -0.184226 -0.246548 -0.152496 -0.127632 -0.183362 0.101322 0.098020 0.098899 0.095265 0.100947 0.100453 0.098066 0.092889 0.124570 0.096508 0.088100 0.099633 0.089979 0.094752 0.095052 0.144416 0.139187 0.151423 0.164100 0.160775 0.162076 0.148884 0.162964 0.160895 0.161650
qa: -0.2824 -0.4655 -0.3387 -0.1023 0.1505 -0.0063 -0.1172 -0.2941 -0.2700 -0.2735 0.3901 -0.0316 -0.2511 -0.2293 0.4184 0.0300 -0.2202 -0.2352 -0.2419 0.2633 -0.1346 -0.1704 0.2753 -0.1842 -0.2465 -0.1525 -0.1276 -0.1834 0.1013 0.0980 0.0989 0.0953 0.1009 0.1005 0.0981 0.0929 0.1246 0.0965 0.0881 0.0996 0.0900 0.0948 0.0951 0.1444 0.1392 0.1514 0.1641 0.1608 0.1621 0.1489 0.1630 0.1609 0.1617
va: 2.1243 2.0425 2.0610 3.1104 3.6723 3.7921 3.8779 3.9021 3.9040 3.8695 4.2042 3.7003 3.9414 3.9260 3.7015 3.5882 4.0877 4.0802 3.9537 3.7531 3.9010 3.9120 3.6822 3.9002 4.0031 3.8897 3.8813 3.8947 1.0225 1.0351 1.0006 1.0142 1.0019 1.0028 1.0021 1.0019 1.0064 0.9977 1.0078 0.9981 1.0074 0.9963 0.9953 1.0166 1.0172 1.0113 0.9891 0.9937 0.9952 1.0069 0.9893 0.9882 0.9891
dispcorr: -0.025559814 hartree
energy: -1210.118318839158
dipole: 35.18631 -32.96627 2.22004 17.16036 -17.73896 -0.57860 14.76564 -13.50679 1.25885
magnitude: 2.61688 au
magnitude: 6.65158 debye
