program: Orca
programVersion: 5.0.2
elementType: O O O N C C C C C C C C C C C C C C C C C C C C C C C C H H H H H H H H H H H H H H H H H H H H H H H H H
charge: 0
multiplicity: 1
keywords: wb97x-d3
keywords: def2-TZVPP
keywords: def2/J RIJCOSX
keywords: DEFGRID2
keywords: scfconv7
keywords: smallprint printgap noloewdin
keywords: NOSOSCF
formula: C24H25NO3
InChI: InChI=1/C24H25NO3/c1-16(2)13-20-22(24(20,3)4)23(26)28-21(15-25)17-9-8-12-19(14-17)27-18-10-6-5-7-11-18/h5-14,20-22H,1-4H3
53 atoms
O  -1.389087 1.583692 -1.230041
O  -1.08867 1.622105 0.982133
O  -1.314012 -3.424818 -0.589647
N  -4.013487 3.122936 0.257579
C  1.479376 3.244841 0.076998
C  1.86736 1.87389 0.537896
C  0.764227 2.024524 -0.489933
C  0.775666 4.161807 1.045941
C  2.372096 3.983328 -0.889594
C  3.133911 1.234602 0.124827
C  -0.62327 1.724722 -0.125897
C  4.062255 0.71755 0.935539
C  3.972676 0.690497 2.429904
C  5.300737 0.08701 0.374762
C  -2.747368 1.233857 -1.037682
C  -2.934071 -0.147967 -0.441869
C  -3.440673 2.28242 -0.279559
C  -2.02437 -1.140154 -0.781712
C  -4.019028 -0.447093 0.372357
C  -2.188208 -2.418658 -0.268357
C  -4.185048 -1.739195 0.849216
C  -3.266465 -2.730996 0.544447
C  0.036381 -3.197582 -0.479895
C  0.858931 -3.852201 -1.385743
C  0.575757 -2.395155 0.518639
C  2.234859 -3.697025 -1.292714
C  1.953104 -2.24554 0.594527
C  2.788515 -2.888742 -0.30907
H  1.514044 1.62763 1.533842
H  1.021433 1.784861 -1.515587
H  1.513337 4.790539 1.547919
H  0.081664 4.824155 0.524832
H  0.223491 3.632598 1.819696
H  3.183327 4.47704 -0.35102
H  2.818101 3.331491 -1.639331
H  1.807425 4.754595 -1.41614
H  3.3180 1.190965 -0.944586
H  3.074684 1.158694 2.827342
H  4.004286 -0.33897 2.796138
H  4.833409 1.198604 2.871814
H  5.316238 0.105762 -0.714568
H  6.197691 0.597565 0.734942
H  5.389484 -0.953923 0.697254
H  -3.177934 1.249088 -2.042908
H  -1.186478 -0.928866 -1.434654
H  -4.739255 0.314187 0.642875
H  -5.02993 -1.970463 1.483646
H  -3.383019 -3.734475 0.932579
H  0.42508 -4.478499 -2.154923
H  -0.06025 -1.892097 1.235905
H  2.874195 -4.207584 -2.000947
H  2.372831 -1.623593 1.374361
H  3.861312 -2.763901 -0.243173
elementType: O N C H
totalener: -1210.09299240 hartree
nucrepener: 2590.85154207 hartree
electener: -3800.94453447 hartree
oneelecener: -6793.42046893 hartree
twoeener: 2992.47593446 hartree
cpcmener: -0.03847802 hartree
kineticenergy: 1204.69611782 hartree
xcener: -118.587744810805 hartree
chargesum: -0.0000000
charge: -0.294895 -0.466553 -0.343128 -0.096649 0.115471 0.053472 -0.107779 -0.276642 -0.268913 -0.287643 0.414011 -0.066547 -0.260921 -0.238442 0.526223 -0.039596 -0.251759 -0.226145 -0.195814 0.247196 -0.118100 -0.227923 0.305491 -0.262583 -0.201761 -0.112713 -0.149513 -0.219108 0.098969 0.093363 0.098966 0.101636 0.091823 0.098470 0.090383 0.098954 0.123751 0.093621 0.093394 0.107485 0.094832 0.106596 0.090783 0.150844 0.152761 0.136375 0.162807 0.150910 0.148408 0.150550 0.161004 0.189934 0.164644
qa: -0.2949 -0.4666 -0.3431 -0.0966 0.1155 0.0535 -0.1078 -0.2766 -0.2689 -0.2876 0.4140 -0.0665 -0.2609 -0.2384 0.5262 -0.0396 -0.2518 -0.2261 -0.1958 0.2472 -0.1181 -0.2279 0.3055 -0.2626 -0.2018 -0.1127 -0.1495 -0.2191 0.0990 0.0934 0.0990 0.1016 0.0918 0.0985 0.0904 0.0990 0.1238 0.0936 0.0934 0.1075 0.0948 0.1066 0.0908 0.1508 0.1528 0.1364 0.1628 0.1509 0.1484 0.1506 0.1610 0.1899 0.1646
va: 2.1298 2.0299 2.0637 3.1010 3.7387 3.7286 3.8682 3.9059 3.9046 3.8093 4.1163 3.7379 3.9377 3.9137 3.7586 3.7307 4.1062 3.9604 3.9416 3.7395 3.9099 4.0225 3.6550 4.0155 3.8865 3.9022 3.8363 3.9116 1.0271 1.0381 1.0005 0.9998 1.0168 1.0020 1.0055 1.0023 1.0097 1.0088 0.9962 0.9983 1.0069 0.9990 0.9940 0.9870 1.0119 1.0152 0.9885 1.0031 1.0074 1.0070 0.9882 0.9592 0.9883
dispcorr: -0.029458710 hartree
energy: -1210.122451109531
dipole: 33.88960 -32.00332 1.88628 10.86097 -11.61287 -0.75190 5.87871 -7.13695 -1.25824
magnitude: 2.38885 au
magnitude: 6.07196 debye
