program: Orca
programVersion: 5.0.2
elementType: O O O N C C C C C C C C C C C C C C C C C C C C C C C C H H H H H H H H H H H H H H H H H H H H H H H H H
charge: 0
multiplicity: 1
keywords: wb97x-d3
keywords: def2-TZVPP
keywords: def2/J RIJCOSX
keywords: DEFGRID2
keywords: scfconv7
keywords: smallprint printgap noloewdin
keywords: NOSOSCF
formula: C24H25NO3
InChI: InChI=1/C24H25NO3/c1-16(2)13-20-22(24(20,3)4)23(26)28-21(15-25)17-9-8-12-19(14-17)27-18-10-6-5-7-11-18/h5-14,20-22H,1-4H3
53 atoms
O  -0.594445 1.597843 -0.174836
O  -1.122798 3.501639 0.862936
O  0.014892 -3.310616 -0.755341
N  -2.112598 0.791639 2.755959
C  1.353975 4.565785 -0.822132
C  1.734369 4.361203 0.601219
C  1.039995 3.236502 -0.143667
C  0.246118 5.53249 -1.156494
C  2.420552 4.49125 -1.886404
C  3.144947 4.186323 1.034628
C  -0.318917 2.84926 0.240765
C  3.549722 3.33174 1.977563
C  2.620229 2.415582 2.713129
C  4.992799 3.215738 2.359882
C  -1.863119 1.05992 0.162121
C  -1.975067 -0.301276 -0.47584
C  -1.990854 0.935857 1.621063
C  -0.952393 -1.22656 -0.302328
C  -3.102086 -0.625237 -1.215297
C  -1.056078 -2.472308 -0.897411
C  -3.196861 -1.884374 -1.794103
C  -2.178342 -2.811227 -1.647309
C  -0.193589 -4.665224 -0.641205
C  0.610963 -5.500904 -1.399706
C  -1.130529 -5.182601 0.244168
C  0.477803 -6.876308 -1.266104
C  -1.259847 -6.558991 0.359307
C  -0.459434 -7.409769 -0.392576
H  1.089279 4.87113 1.31344
H  1.666077 2.409146 -0.457102
H  -0.300683 5.211914 -2.044896
H  -0.468859 5.66368 -0.34715
H  0.674527 6.512977 -1.372365
H  1.981411 4.219831 -2.847771
H  2.907246 5.460858 -2.008085
H  3.192311 3.757334 -1.654902
H  3.885561 4.817397 0.551203
H  2.779778 1.378392 2.405883
H  2.816528 2.451218 3.786923
H  1.568376 2.64977 2.559804
H  5.630905 3.867795 1.764107
H  5.140132 3.465989 3.41338
H  5.34634 2.188989 2.235012
H  -2.673906 1.705782 -0.187689
H  -0.074662 -0.987511 0.28629
H  -3.897574 0.097193 -1.344248
H  -4.068986 -2.143614 -2.37891
H  -2.258728 -3.78114 -2.120877
H  1.336884 -5.079275 -2.083071
H  -1.749173 -4.525084 0.842201
H  1.106699 -7.530641 -1.855312
H  -1.98825 -6.966297 1.047944
H  -0.56414 -8.481965 -0.295111
elementType: O N C H
totalener: -1210.09300560 hartree
nucrepener: 2413.20077262 hartree
electener: -3623.29377823 hartree
oneelecener: -6438.06615665 hartree
twoeener: 2814.77237842 hartree
cpcmener: -0.03710643 hartree
kineticenergy: 1204.70680488 hartree
xcener: -118.582931073835 hartree
chargesum: -0.0000000
charge: -0.286464 -0.477211 -0.339380 -0.107765 0.145466 -0.004800 -0.103516 -0.277753 -0.283445 -0.309571 0.403805 -0.008927 -0.240713 -0.228614 0.441893 -0.010400 -0.230548 -0.220341 -0.184226 0.214702 -0.143973 -0.160310 0.255747 -0.234008 -0.171589 -0.133117 -0.153527 -0.177472 0.105526 0.098177 0.102266 0.091377 0.097618 0.098750 0.100268 0.094086 0.125331 0.104034 0.101867 0.079011 0.089561 0.097370 0.095162 0.134401 0.141238 0.150580 0.164068 0.159923 0.149693 0.160532 0.160674 0.162753 0.161786
qa: -0.2865 -0.4772 -0.3394 -0.1078 0.1455 -0.0048 -0.1035 -0.2778 -0.2834 -0.3096 0.4038 -0.0089 -0.2407 -0.2286 0.4419 -0.0104 -0.2305 -0.2203 -0.1842 0.2147 -0.1440 -0.1603 0.2557 -0.2340 -0.1716 -0.1331 -0.1535 -0.1775 0.1055 0.0982 0.1023 0.0914 0.0976 0.0988 0.1003 0.0941 0.1253 0.1040 0.1019 0.0790 0.0896 0.0974 0.0952 0.1344 0.1412 0.1506 0.1641 0.1599 0.1497 0.1605 0.1607 0.1628 0.1618
va: 2.1506 2.0202 2.0563 3.1058 3.7055 3.8066 3.8362 3.8951 3.9084 3.8977 4.1184 3.7029 3.9366 3.9316 3.7090 3.7514 4.0192 4.0715 3.9468 3.8145 3.9105 3.8981 3.6923 3.9989 3.9012 3.8859 3.8874 3.8886 1.0244 1.0262 0.9988 1.0156 1.0007 1.0029 0.9998 1.0018 1.0034 0.9976 1.0004 1.0138 1.0061 0.9961 0.9961 1.0191 1.0268 1.0016 0.9900 0.9940 1.0061 0.9952 0.9884 0.9894 0.9890
dispcorr: -0.024757146 hartree
energy: -1210.117762749200
dipole: 21.82425 -21.27984 0.54441 20.13622 -21.00654 -0.87032 -0.97726 -1.42298 -2.40024
magnitude: 2.61055 au
magnitude: 6.63550 debye
