program: Gaussian 09
title: 000072401
version: EM64L-G09RevD.01
frameworkgroup: C1[X(C21H18O9)]
method: RPBEPBE
basis: SDD
operation: Freq
keyword: #pfreq=noraman
keyword: PBEPBE/SDD
title: #p freq=noraman PBEPBE/SDD
converged: YES YES NO NO
title: Mulliken charges:
elementType: O O O O O O O O O C C C C C C C C C C C C C C C C C C C C C H H H H H H H H H H H H H H H H H H
charge: -0.432288 -0.463310 -0.352201 -0.368919 -0.219414 -0.437818 -0.162783 -0.163515 -0.287478 0.169912 -0.551843 -0.650186 -0.228491 0.199870 0.073709 -0.122016 -0.079183 0.116278 0.204905 0.188039 -0.146749 -0.197537 -0.372485 0.119396 0.297001 0.210325 -0.419069 -0.352374 -0.203291 -0.515356 0.249858 0.235021 0.287231 0.227290 0.318950 0.358605 0.356026 0.237613 0.259462 0.363701 0.401422 0.290549 0.254780 0.366520 0.238165 0.203524 0.230994 0.267161
chargesum: 0.00000
title: Mulliken charges with hydrogens summed into heavy atoms:
elementType: O O O O O O O O O C C C C C C C C C C C C C C C C C C C C C
charge: -0.073683 -0.107285 0.011500 0.032503 -0.219414 -0.071298 -0.162783 -0.163515 -0.287478 0.169912 -0.066964 -0.135666 0.090460 0.199870 0.073709 -0.122016 -0.079183 0.116278 0.204905 0.188039 -0.146749 -0.197537 0.124590 0.119396 0.297001 0.210325 -0.128521 -0.097594 0.034874 0.186324
polarizability: 3.89025817e+02 -1.23010318e+01 2.84844088e+02 3.57427230e+01 1.30801695e+01 1.66638689e+02
1716.lowfreq: -5.2794 0.0004 0.0005 0.0006 2.1405 8.6333 18.0587 25.6783 34.3971
frequency: 18.0209 25.6414 34.3935 43.1596 54.7396 69.4430 72.1907 101.8003 109.6053 131.0837 138.9922 150.4783 156.3466 164.7806 183.5970 198.3366 211.9447 225.6973 231.9234 251.6156 259.5961 276.9035 287.2767 296.2713 312.0501 332.7737 336.2572 353.8997 364.3911 368.4689 375.8399 380.4122 388.2335 396.1895 421.7041 429.3716 432.4576 457.4448 458.7386 468.9601 487.0219 514.5025 524.6063 530.8284 560.0954 561.4184 581.8933 597.7187 605.7936 657.7628 679.3186 688.1079 705.0520 737.9167 764.9723 773.5249 786.0659 801.0128 820.8437 822.6677 857.7909 879.0694 884.0717 894.6658 920.1230 933.9951 941.2777 953.2609 968.7719 991.7201 996.9274 1002.1832 1019.1190 1027.0007 1058.9111 1064.7926 1092.2737 1099.8750 1103.8030 1120.3318 1139.8579 1150.7230 1162.8715 1167.0276 1184.6814 1194.1804 1209.6254 1212.3134 1220.4988 1248.4941 1249.9027 1279.7582 1285.9473 1297.5819 1311.3695 1319.9468 1333.5005 1338.0634 1354.2822 1363.0936 1376.7513 1377.1491 1404.6532 1410.2150 1413.1370 1435.1185 1442.2226 1446.5253 1448.5253 1450.5279 1452.7848 1470.9929 1482.8210 1540.0570 1549.8512 1573.8922 1581.0146 1595.7555 1602.9482 1606.3492 2927.0478 2966.6380 2966.7370 2996.5006 3013.7177 3022.0047 3038.2069 3075.0108 3080.7648 3128.4869 3139.7968 3160.3634 3172.5571 3189.9698 3454.0182 3539.5264 3545.2812 3546.0397
redmass: 7.2384 5.7111 7.9627 6.6437 7.8162 7.2423 7.2979 3.0666 4.8002 3.8747 3.8340 5.0906 1.6356 2.8939 5.2394 5.3645 3.5152 3.7665 2.0571 3.2955 5.6506 4.2815 3.7263 5.6373 3.3610 5.2032 6.2024 4.5989 2.9873 2.2900 2.1495 5.3330 1.7065 2.4534 5.9441 1.4802 6.1947 3.6239 6.5627 4.2334 6.4309 5.1798 5.0162 5.9874 4.0625 3.5625 4.8085 5.2764 4.0414 6.0748 4.5873 5.4790 3.9790 5.7526 3.7317 8.3810 4.3889 2.9236 3.1588 1.3497 4.9648 5.5659 4.4376 4.8202 2.0568 1.6613 3.8450 3.0596 3.8597 3.8158 1.3585 3.0818 4.8017 3.2816 2.6467 2.7103 2.3314 2.1420 1.2482 2.7057 1.6148 1.3221 1.2858 1.2642 1.6188 1.0986 2.9576 1.5542 2.5241 2.6098 1.3981 2.3492 2.4653 3.5406 1.9477 2.2363 1.8057 1.8181 1.7795 1.2491 1.6338 5.0109 3.6344 4.1543 1.9274 3.0369 1.1046 1.5968 1.1014 2.0643 1.3359 1.1163 1.0550 10.2385 8.4866 7.4115 6.9350 8.8463 8.8279 7.6241 1.0682 1.0522 1.0416 1.0629 1.0996 1.0896 1.0838 1.1009 1.0975 1.1040 1.0871 1.0926 1.0985 1.0667 1.0646 1.0663 1.0659 1.0652
irintensity: 0.3977 0.4446 2.2228 2.7511 4.4641 0.9677 0.0713 2.6719 16.7942 5.1584 0.6329 0.5870 1.3977 3.8835 12.6164 5.8126 5.0719 14.6661 13.8200 39.7315 5.9509 10.1806 19.4209 2.2192 10.4485 6.0475 8.6133 13.6755 64.5515 26.1802 39.8787 4.9890 146.3961 40.8726 18.0624 135.9302 13.4556 37.7469 8.8643 15.2406 2.4555 3.2941 1.6695 4.3158 7.2666 9.8420 4.1250 11.9027 2.1912 3.7988 6.0674 6.8376 10.6502 22.5063 23.8911 3.1708 8.6567 12.7425 9.8686 127.9903 4.0165 22.0971 97.0047 37.6548 4.1168 30.0531 146.3502 8.8171 81.7328 178.6738 1.8424 33.3148 57.2563 45.0005 8.2523 10.3861 16.0089 134.4309 22.2177 15.4484 10.3099 5.3703 20.7217 20.9811 23.8043 9.5726 59.1820 37.6532 76.6185 380.7769 81.2579 167.1696 42.1293 244.5482 55.3022 23.3073 23.4572 51.6426 26.3425 36.9225 58.6361 12.2575 60.1431 10.0460 17.1467 45.0078 26.7999 17.2764 8.4462 13.7078 21.9276 12.1558 12.1578 116.4440 211.6735 73.2917 3.9650 56.3529 16.5529 39.8838 53.8208 58.9671 59.1824 14.0907 11.5335 9.0778 1.5939 15.2537 20.9923 17.7447 7.9771 5.5597 20.7287 476.0010 16.8537 16.9438 15.2368 30.3499
temp: 298.150 k
press: 1.00000 atm
elementType: 8 8 8 8 8 8 8 8 8 6 6 6 6 6 6 6 6 6 6 6 6 6 6 6 6 6 6 6 6 6 1 1 1 1 1 1 1 1 1 1 1 1 1 1 1 1 1 1
symmnumber: 1
zpe: 924891.6 jmol-1
zpe.correction: 0.352273 hartree
zpe.thermalcorrener: 0.379775 hartree
zpe.thermalcorrenthalpy: 0.380719 hartree
zpe.thermalcorrgfe: 0.294216 hartree
zpe.sumelectzpe: -1485.845023 hartree
zpe.sumelectthermal: -1485.817521 hartree
zpe.sumelectthermalent: -1485.816577 hartree
zpe.sumelectthermalfe: -1485.903079 hartree
dipole: -3.7586 1.0790 -3.1320
dipole: 5.0101
quadrupole: -138.8827 -185.0050 -180.8882
quadrupole: -9.6879 18.4284 -8.0158
quadrupole: 29.3760 -16.7464 -12.6296 -9.6879 18.4284 -8.0158
hfenergy: -1486.1972955 hartree
pointgroup: C01 [X(C21H18O9)]
dipole: -1.4797743 -0.3275853 1.2602536 debye
polarizability: 389.0672294|8.5166765|285.6556941|-37.1059869|6.6873426|165.7856702 unknown
InChI: InChI=1S/C21H18O9/c1-30-11-4-2-3-8-14(11)20(28)16-15(17(8)25)18(26)9-5-21(29,12(24)7-22)6-10(23)13(9)19(16)27/h2-4,10,22-23,26-27,29H,5-7H2,1H3
charge 0 multiplicity 1
48 atoms
O  -5.615653 0.597992 1.047914
O  -2.440481 -3.230111 1.114068
O  -0.939635 2.689697 1.308972
O  -0.048417 -2.72859 0.121155
O  -4.682982 -0.835218 -1.740795
O  -4.78888 1.514107 -3.062538
O  2.555596 -2.187622 0.75071
O  1.681803 3.022752 1.240176
O  4.717875 -1.75048 -1.116002
C  -4.335365 0.061483 0.521224
C  -4.11119 -1.394047 0.962007
C  -3.255587 0.969776 1.134785
C  -2.754209 -1.917856 0.465428
C  -1.841807 0.437768 0.928249
C  -1.60751 -0.927275 0.649524
C  -0.738317 1.338281 1.012354
C  -0.271871 -1.402835 0.452243
C  -4.448945 0.178229 -1.022918
C  0.594751 0.888145 0.780593
C  0.82792 -0.503163 0.520666
C  2.239043 -1.011349 0.402646
C  1.753613 1.840959 0.783903
C  -4.372374 1.552558 -1.679682
C  3.26194 -0.031507 -0.071667
C  3.034605 1.355487 0.165898
C  4.479994 -0.429631 -0.705246
C  4.014634 2.319267 -0.169354
C  5.438472 0.548198 -1.064762
C  5.214562 1.914599 -0.786702
C  5.415355 -2.636906 -0.157899
H  -4.906597 -2.049794 0.566131
H  -4.14826 -1.417317 2.069235
H  -3.493839 1.050949 2.214521
H  -3.380405 1.987568 0.714009
H  -2.834135 -2.20412 -0.598376
H  -6.355033 -0.016653 0.799132
H  -2.405952 -3.111941 2.09873
H  -3.320316 1.911484 -1.605687
H  -5.01349 2.264573 -1.125149
H  -1.89629 2.881261 1.481694
H  -0.851939 -3.277799 0.394303
H  3.807073 3.36919 0.056868
H  6.344959 0.214828 -1.580723
H  -4.837331 0.556068 -3.338033
H  5.969245 2.65796 -1.064623
H  6.382676 -2.191485 0.148836
H  5.590579 -3.572354 -0.710163
H  4.767916 -2.822729 0.714846
