program: Orca
programVersion: 5.0.2
elementType: O O O N C C C C C C C C C C C C C C C C C C C C C C C C H H H H H H H H H H H H H H H H H H H H H H H H H
charge: 0
multiplicity: 1
keywords: wb97x-d3
keywords: def2-TZVPP
keywords: def2/J RIJCOSX
keywords: DEFGRID2
keywords: scfconv7
keywords: smallprint printgap noloewdin
keywords: NOSOSCF
formula: C24H25NO3
InChI: InChI=1/C24H25NO3/c1-16(2)13-20-22(24(20,3)4)23(26)28-21(15-25)17-9-8-12-19(14-17)27-18-10-6-5-7-11-18/h5-14,20-22H,1-4H3
53 atoms
O  -1.169451 1.706053 0.247182
O  -1.511632 2.025802 -1.932013
O  -1.249921 -3.288421 -0.653485
N  -2.994843 1.407328 2.974586
C  1.502341 3.16009 -0.245756
C  1.687822 1.684572 -0.067539
C  0.702285 2.187229 -1.102212
C  0.84214 3.956394 0.853185
C  2.565602 3.938471 -0.980881
C  2.903731 0.971972 -0.52873
C  -0.74876 1.979805 -0.99698
C  3.849012 0.469914 0.271073
C  3.819915 0.571157 1.764587
C  5.029972 -0.26057 -0.290523
C  -2.532688 1.356471 0.402581
C  -2.842895 -0.026388 -0.130997
C  -2.770752 1.3986 1.846437
C  -1.858345 -1.00803 -0.110335
C  -4.113719 -0.297958 -0.610443
C  -2.158835 -2.273206 -0.594724
C  -4.401978 -1.5748 -1.074816
C  -3.433822 -2.562813 -1.07269
C  -0.006637 -3.117741 -0.079664
C  0.137365 -3.179285 1.298671
C  1.087654 -2.930202 -0.908708
C  1.404466 -3.054496 1.85028
C  2.351664 -2.814744 -0.345013
C  2.513068 -2.875358 1.032331
H  1.236496 1.287279 0.835634
H  1.029796 2.133701 -2.134967
H  0.191876 3.362452 1.491014
H  1.611128 4.390641 1.494622
H  0.256314 4.781176 0.443218
H  3.379326 4.197917 -0.300989
H  2.993388 3.38148 -1.813397
H  2.155959 4.868906 -1.377551
H  3.023145 0.855505 -1.602097
H  3.707899 -0.417944 2.217702
H  4.764235 0.974047 2.138018
H  3.018633 1.203444 2.142434
H  5.100686 -1.269389 0.125337
H  4.984545 -0.344797 -1.376072
H  5.962881 0.245315 -0.028639
H  -3.195301 2.096414 -0.058754
H  -0.869603 -0.782499 0.267965
H  -4.869591 0.476817 -0.625827
H  -5.390794 -1.80038 -1.450875
H  -3.657045 -3.554293 -1.445301
H  -0.728321 -3.324684 1.932837
H  0.954367 -2.882825 -1.98206
H  1.524253 -3.101168 2.924663
H  3.211475 -2.674901 -0.987203
H  3.499741 -2.783722 1.467002
elementType: O N C H
totalener: -1210.09080549 hartree
nucrepener: 2612.20238129 hartree
electener: -3822.29318678 hartree
oneelecener: -6835.68695409 hartree
twoeener: 3013.39376732 hartree
cpcmener: -0.03807889 hartree
kineticenergy: 1204.70103080 hartree
xcener: -118.585968840316 hartree
chargesum: 0.0000000
charge: -0.280540 -0.467071 -0.336228 -0.100909 0.167934 0.041335 -0.137600 -0.294453 -0.269599 -0.309134 0.416792 -0.044945 -0.255112 -0.242546 0.373014 0.004153 -0.222637 -0.187815 -0.240402 0.301735 -0.097239 -0.252842 0.253184 -0.174882 -0.188387 -0.149132 -0.174761 -0.164845 0.105569 0.092827 0.093080 0.095329 0.104155 0.096269 0.092437 0.099373 0.125341 0.092579 0.102988 0.092143 0.087251 0.095912 0.109331 0.150576 0.135786 0.147897 0.161590 0.148852 0.154849 0.149939 0.161897 0.167212 0.169750
qa: -0.2805 -0.4671 -0.3362 -0.1009 0.1679 0.0413 -0.1376 -0.2945 -0.2696 -0.3091 0.4168 -0.0449 -0.2551 -0.2425 0.3730 0.0042 -0.2226 -0.1878 -0.2404 0.3017 -0.0972 -0.2528 0.2532 -0.1749 -0.1884 -0.1491 -0.1748 -0.1648 0.1056 0.0928 0.0931 0.0953 0.1042 0.0963 0.0924 0.0994 0.1253 0.0926 0.1030 0.0921 0.0873 0.0959 0.1093 0.1506 0.1358 0.1479 0.1616 0.1489 0.1548 0.1499 0.1619 0.1672 0.1698
va: 2.1067 2.0369 2.0805 3.1072 3.6926 3.6934 3.9600 3.9183 3.9101 3.7924 4.1222 3.6915 3.9350 3.9184 3.7494 3.6698 4.0715 3.9252 4.0021 3.7229 3.8834 4.0004 3.6967 3.9398 3.9827 3.9025 3.8392 3.8240 1.0126 1.0336 1.0092 1.0010 0.9991 1.0028 1.0031 1.0024 1.0076 1.0012 0.9992 1.0066 0.9943 1.0058 1.0000 1.0148 1.0217 1.0012 0.9873 1.0070 0.9981 1.0027 0.9900 0.9854 0.9809
dispcorr: -0.030498248 hartree
energy: -1210.121303739242
dipole: 31.99263 -30.25957 1.73306 11.47454 -11.36762 0.10692 1.59059 -1.92932 -0.33873
magnitude: 1.76909 au
magnitude: 4.49666 debye
