program: Orca
programVersion: 5.0.2
elementType: O O O N C C C C C C C C C C C C C C C C C C C C C C C C H H H H H H H H H H H H H H H H H H H H H H H H H
charge: 0
multiplicity: 1
keywords: wb97x-d3
keywords: def2-TZVPP
keywords: def2/J RIJCOSX
keywords: DEFGRID2
keywords: scfconv7
keywords: smallprint printgap noloewdin
keywords: NOSOSCF
formula: C24H25NO3
InChI: InChI=1/C24H25NO3/c1-16(2)13-20-22(24(20,3)4)23(26)28-21(15-25)17-9-8-12-19(14-17)27-18-10-6-5-7-11-18/h5-14,20-22H,1-4H3
53 atoms
O  -1.276011 1.815666 -0.083828
O  -1.324471 2.198043 -2.284502
O  -1.057894 -3.170795 -0.612716
N  -3.516579 2.141126 2.298649
C  1.541182 2.945305 -0.078582
C  1.58517 1.453651 -0.153379
C  0.768122 2.220411 -1.174224
C  0.843645 3.612285 1.081972
C  2.740243 3.724929 -0.561299
C  2.784264 0.70272 -0.609573
C  -0.692123 2.096454 -1.261275
C  3.816621 0.391607 0.177557
C  3.89267 0.782208 1.620753
C  4.987778 -0.385315 -0.3395
C  -2.645424 1.477731 -0.075738
C  -2.87555 -0.00479 -0.304565
C  -3.123579 1.851234 1.257464
C  -1.808562 -0.889504 -0.342393
C  -4.17995 -0.460084 -0.450335
C  -2.059085 -2.245353 -0.51838
C  -4.411042 -1.815033 -0.627068
C  -3.357227 -2.715563 -0.655751
C  0.148971 -2.969997 0.015471
C  1.293359 -3.274456 -0.706782
C  0.231538 -2.546677 1.336135
C  2.534466 -3.162318 -0.095951
C  1.480332 -2.423443 1.928621
C  2.633516 -2.73442 1.220329
H  0.997828 0.952021 0.611786
H  1.211213 2.30515 -2.160523
H  1.586102 3.878199 1.83678
H  0.352645 4.535904 0.770376
H  0.104961 2.980599 1.568499
H  3.201498 3.284485 -1.444342
H  2.457827 4.749885 -0.807611
H  3.500006 3.769747 0.221944
H  2.802895 0.383041 -1.647432
H  3.983109 -0.103473 2.255484
H  4.784122 1.385903 1.809379
H  3.027298 1.34951 1.960005
H  5.907324 0.201096 -0.265552
H  5.151746 -1.289094 0.252895
H  4.858338 -0.681382 -1.380224
H  -3.214618 2.0646 -0.804225
H  -0.790223 -0.540668 -0.236849
H  -5.009025 0.236323 -0.42385
H  -5.423847 -2.177921 -0.738437
H  -3.539035 -3.774159 -0.789376
H  1.21182 -3.604744 -1.73447
H  -0.661983 -2.317254 1.902974
H  3.427269 -3.403953 -0.657706
H  1.54752 -2.089372 2.955617
H  3.603065 -2.63953 1.690911
elementType: O N C H
totalener: -1210.08903859 hartree
nucrepener: 2623.77523439 hartree
electener: -3833.86427298 hartree
oneelecener: -6858.46528471 hartree
twoeener: 3024.60101173 hartree
cpcmener: -0.03669919 hartree
kineticenergy: 1204.69746539 hartree
xcener: -118.587582483472 hartree
chargesum: 0.0000000
charge: -0.280483 -0.466819 -0.335322 -0.101720 0.167425 -0.006505 -0.095447 -0.295567 -0.290415 -0.285205 0.394856 -0.038666 -0.262244 -0.247111 0.368817 0.052115 -0.219715 -0.182463 -0.259017 0.280581 -0.098607 -0.257319 0.301265 -0.241775 -0.189988 -0.148835 -0.166880 -0.161232 0.108121 0.092334 0.095878 0.108422 0.091656 0.094159 0.104264 0.097662 0.124269 0.097820 0.109655 0.095020 0.109978 0.088743 0.096455 0.146285 0.149268 0.151366 0.162641 0.148830 0.147697 0.159210 0.160109 0.161071 0.165359
qa: -0.2805 -0.4668 -0.3353 -0.1017 0.1674 -0.0065 -0.0954 -0.2956 -0.2904 -0.2852 0.3949 -0.0387 -0.2622 -0.2471 0.3688 0.0521 -0.2197 -0.1825 -0.2590 0.2806 -0.0986 -0.2573 0.3013 -0.2418 -0.1900 -0.1488 -0.1669 -0.1612 0.1081 0.0923 0.0959 0.1084 0.0917 0.0942 0.1043 0.0977 0.1243 0.0978 0.1097 0.0950 0.1100 0.0887 0.0965 0.1463 0.1493 0.1514 0.1626 0.1488 0.1477 0.1592 0.1601 0.1611 0.1654
va: 2.0968 2.0379 2.0808 3.1071 3.6899 3.7482 3.9466 3.9077 3.9187 3.7878 4.1584 3.6631 3.9282 3.9163 3.7227 3.6409 4.0417 3.9440 4.0057 3.7540 3.8824 4.0053 3.6615 4.0034 3.8947 3.8543 3.8692 3.8197 1.0101 1.0290 1.0005 0.9999 1.0093 1.0023 1.0025 0.9991 1.0078 1.0022 0.9990 1.0034 0.9994 0.9963 1.0043 1.0231 0.9941 1.0004 0.9871 1.0066 1.0070 0.9944 0.9900 0.9919 0.9834
dispcorr: -0.031871639 hartree
energy: -1210.120910225638
dipole: 32.76120 -30.97678 1.78442 8.86096 -9.26474 -0.40379 4.57789 -4.54625 0.03164
magnitude: 1.82981 au
magnitude: 4.65100 debye
