program: Orca
programVersion: 5.0.2
elementType: O O O O N C C C C C C C C C C C C C C C C C C C C C C C C H H H H H H H H H H H H H H H H H H H H H H H H H
charge: 0
multiplicity: 1
keywords: wb97x-d3
keywords: def2-TZVPP
keywords: def2/J RIJCOSX
keywords: DEFGRID2
keywords: scfconv7
keywords: smallprint printgap noloewdin
keywords: NOSOSCF
formula: C24H25NO4
InChI: InChI=1/C24H25NO4/c1-23(2)19(21-24(3,4)29-21)20(23)22(26)28-18(14-25)15-9-8-12-17(13-15)27-16-10-6-5-7-11-16/h5-13,18-21H,1-4H3
54 atoms
O  -3.033004 3.479597 0.090092
O  -1.189633 -1.48202 -0.423057
O  -2.605338 -0.585572 1.057394
O  3.545371 0.761349 0.430909
N  0.778634 -4.140548 -0.358841
C  -3.351487 1.366943 -1.139282
C  -4.280101 0.241424 -1.431387
C  -2.796914 -0.047124 -1.271333
C  -3.333472 2.098058 0.167228
C  -2.107354 2.637042 0.760615
C  -5.288634 -0.231444 -0.412781
C  -4.790535 0.13084 -2.850174
C  -2.235926 -0.703825 -0.080389
C  -2.037635 2.816709 2.254176
C  -0.770372 2.459483 0.090039
C  -0.469443 -2.078495 0.649145
C  0.501509 -1.101554 1.268178
C  0.224285 -3.230142 0.068398
C  1.597012 -0.665629 0.530302
C  0.263418 -0.605226 2.540503
C  2.468313 0.26124 1.085099
C  1.134057 0.332653 3.078112
C  2.234056 0.764537 2.361277
C  4.158193 0.048706 -0.564145
C  4.433525 0.714042 -1.748326
C  4.553546 -1.270435 -0.38268
C  5.11411 0.052966 -2.759887
C  5.222173 -1.922839 -1.406755
C  5.505469 -1.267044 -2.596381
H  -3.105179 2.005704 -1.981739
H  -2.258341 -0.265422 -2.185863
H  -4.146408 1.856663 0.8503
H  -5.572124 -1.265017 -0.617431
H  -4.938562 -0.187151 0.613967
H  -6.192199 0.376284 -0.487143
H  -4.055901 0.4760 -3.578772
H  -5.689952 0.735249 -2.978351
H  -5.043595 -0.901776 -3.095839
H  -3.027439 2.952841 2.689073
H  -1.433265 3.68821 2.512809
H  -1.579968 1.941597 2.715898
H  -0.855465 2.301562 -0.983904
H  -0.238081 1.609233 0.518462
H  -0.149207 3.343043 0.248242
H  -1.155584 -2.452277 1.415397
H  1.770578 -1.052532 -0.466861
H  -0.600459 -0.934703 3.101601
H  0.955564 0.728018 4.069086
H  2.91858 1.491293 2.778194
H  4.122314 1.743473 -1.867754
H  4.344532 -1.785583 0.546361
H  5.33228 0.573928 -3.68271
H  5.526812 -2.951565 -1.268196
H  6.030586 -1.782068 -3.389242
totalener: -1285.30273058 hartree
nucrepener: 2760.82069214 hartree
electener: -4046.12342272 hartree
oneelecener: -7235.34913234 hartree
twoeener: 3189.22570963 hartree
kineticenergy: 1279.74162137 hartree
xcener: -124.713870369549 hartree
chargesum: -0.0000000
charge: -0.380217 -0.258854 -0.389274 -0.296349 -0.002267 -0.115030 0.093735 -0.099243 0.108481 0.220635 -0.281600 -0.236145 0.326726 -0.241966 -0.214327 0.343544 0.010248 -0.269476 -0.185852 -0.162780 0.243704 -0.098356 -0.202927 0.251998 -0.210140 -0.177307 -0.090972 -0.099448 -0.141759 0.100621 0.085240 0.087474 0.089412 0.100148 0.097823 0.074272 0.092972 0.092555 0.083759 0.088789 0.076237 0.093401 0.015629 0.100357 0.119060 0.131388 0.121000 0.132703 0.129262 0.125368 0.134102 0.126717 0.130137 0.126792
qa: -0.3802 -0.2589 -0.3893 -0.2963 -0.0023 -0.1150 0.0937 -0.0992 0.1085 0.2206 -0.2816 -0.2361 0.3267 -0.2420 -0.2143 0.3435 0.0102 -0.2695 -0.1859 -0.1628 0.2437 -0.0984 -0.2029 0.2520 -0.2101 -0.1773 -0.0910 -0.0994 -0.1418 0.1006 0.0852 0.0875 0.0894 0.1001 0.0978 0.0743 0.0930 0.0926 0.0838 0.0888 0.0762 0.0934 0.0156 0.1004 0.1191 0.1314 0.1210 0.1327 0.1293 0.1254 0.1341 0.1267 0.1301 0.1268
va: 2.0369 2.1358 2.0989 2.1162 3.1203 3.8288 3.7806 3.8613 4.0070 3.8485 3.9141 3.8995 4.1600 3.9370 3.9281 3.8353 3.6197 4.0312 3.9253 3.9281 3.8283 3.9101 4.0171 3.7896 4.0504 3.9675 3.9311 3.9458 3.9643 1.0209 1.0322 1.0011 1.0035 1.0198 0.9982 1.0077 1.0041 1.0043 1.0164 1.0059 1.0103 1.0102 1.0342 1.0107 1.0197 1.0168 1.0202 0.9983 1.0124 1.0137 1.0037 0.9989 0.9995 1.0003
dispcorr: -0.031068908 hartree
energy: -1285.333799488441
dipole: -18.54648 18.41782 -0.12866 11.57318 -11.25404 0.31914 -3.47213 3.46249 -0.00964
magnitude: 0.34424 au
magnitude: 0.87498 debye
