program: Orca
programVersion: 5.0.2
elementType: O O O O N C C C C C C C C C C C C C C C C C C C C C C C C H H H H H H H H H H H H H H H H H H H H H H H H H
charge: 0
multiplicity: 1
keywords: wb97x-d3
keywords: def2-TZVPP
keywords: def2/J RIJCOSX
keywords: DEFGRID2
keywords: scfconv7
keywords: smallprint printgap noloewdin
keywords: NOSOSCF
formula: C24H25NO4
InChI: InChI=1/C24H25NO4/c1-23(2)19(21-24(3,4)29-21)20(23)22(26)28-18(14-25)15-9-8-12-17(13-15)27-16-10-6-5-7-11-16/h5-13,18-21H,1-4H3
54 atoms
O  -2.471353 3.508018 0.337183
O  -1.200194 -1.59627 -0.543485
O  -2.504729 -0.664807 1.011662
O  3.476318 0.379557 0.917808
N  0.622532 -4.345573 -0.737863
C  -3.020678 1.526569 -1.023799
C  -4.082942 0.5427 -1.367068
C  -2.640944 0.070658 -1.266552
C  -2.870079 2.149595 0.328605
C  -1.566041 2.548298 0.863345
C  -5.124858 0.118181 -0.360712
C  -4.625876 0.592873 -2.776966
C  -2.152239 -0.733686 -0.134943
C  -1.36682 2.587031 2.355387
C  -0.301575 2.331471 0.072979
C  -0.58677 -2.373353 0.477275
C  0.393119 -1.571507 1.30125
C  0.087274 -3.471785 -0.219327
C  1.493234 -0.99084 0.67699
C  0.177188 -1.402516 2.657782
C  2.387402 -0.243777 1.431217
C  1.080519 -0.654851 3.401434
C  2.180379 -0.076629 2.798555
C  3.834556 0.171369 -0.388871
C  3.69186 1.216997 -1.286353
C  4.371768 -1.04378 -0.789208
C  4.099027 1.044533 -2.601518
C  4.764628 -1.207833 -2.108455
C  4.629814 -0.167178 -3.016925
H  -2.718723 2.19066 -1.82749
H  -2.14734 -0.145189 -2.206628
H  -3.648135 1.908832 1.050659
H  -4.762708 0.064968 0.661221
H  -5.959353 0.821074 -0.385845
H  -5.518125 -0.866159 -0.619418
H  -3.870515 0.908962 -3.497503
H  -5.455966 1.298494 -2.839686
H  -4.994879 -0.385501 -3.08883
H  -2.30557 2.755852 2.882188
H  -0.675561 3.384317 2.634951
H  -0.946439 1.64191 2.701152
H  0.410065 3.134975 0.273391
H  -0.474168 2.300015 -1.001442
H  0.173285 1.395221 0.367754
H  -1.344384 -2.810049 1.136028
H  1.643876 -1.124973 -0.38728
H  -0.692862 -1.837087 3.130854
H  0.921743 -0.517599 4.462628
H  2.885672 0.508988 3.373348
H  3.273973 2.157579 -0.951486
H  4.481633 -1.851507 -0.07672
H  3.995236 1.861331 -3.30338
H  5.180478 -2.154743 -2.42554
H  4.940713 -0.30035 -4.044278
totalener: -1285.30213673 hartree
nucrepener: 2794.45960300 hartree
electener: -4079.76173974 hartree
oneelecener: -7302.62128582 hartree
twoeener: 3222.85954608 hartree
kineticenergy: 1279.74608064 hartree
xcener: -124.713975175364 hartree
chargesum: 0.0000000
charge: -0.379531 -0.262079 -0.384165 -0.289041 -0.002394 -0.120138 0.084698 -0.076341 0.120431 0.213370 -0.277796 -0.235870 0.311276 -0.231334 -0.245109 0.347838 -0.000100 -0.264947 -0.202281 -0.136570 0.242355 -0.113983 -0.191618 0.228080 -0.170564 -0.165641 -0.116016 -0.110502 -0.123620 0.097222 0.084635 0.089163 0.099815 0.097089 0.089687 0.073936 0.092724 0.092707 0.081627 0.087669 0.077265 0.099075 0.093302 0.035710 0.117794 0.131170 0.108642 0.129244 0.127177 0.125381 0.133074 0.127710 0.131076 0.128702
qa: -0.3795 -0.2621 -0.3842 -0.2890 -0.0024 -0.1201 0.0847 -0.0763 0.1204 0.2134 -0.2778 -0.2359 0.3113 -0.2313 -0.2451 0.3478 -0.0001 -0.2649 -0.2023 -0.1366 0.2424 -0.1140 -0.1916 0.2281 -0.1706 -0.1656 -0.1160 -0.1105 -0.1236 0.0972 0.0846 0.0892 0.0998 0.0971 0.0897 0.0739 0.0927 0.0927 0.0816 0.0877 0.0773 0.0991 0.0933 0.0357 0.1178 0.1312 0.1086 0.1292 0.1272 0.1254 0.1331 0.1277 0.1311 0.1287
va: 2.0407 2.1352 2.1041 2.1175 3.1236 3.8191 3.7957 3.8496 4.0090 3.8847 3.9124 3.8986 4.1699 3.9326 3.9280 3.8317 3.6761 4.0326 3.8946 3.9569 3.8111 3.9455 4.0087 3.8032 4.0237 3.9847 3.9467 3.9435 3.9468 1.0212 1.0315 1.0020 1.0217 0.9986 1.0029 1.0077 1.0043 1.0042 1.0167 1.0065 1.0055 1.0089 1.0095 1.0297 1.0191 1.0250 1.0197 0.9997 1.0132 1.0108 1.0053 0.9995 0.9994 0.9997
dispcorr: -0.031646059 hartree
energy: -1285.333782793306
dipole: -16.91950 16.72232 -0.19718 13.98411 -13.57264 0.41148 -3.80386 3.70184 -0.10203
magnitude: 0.46755 au
magnitude: 1.18841 debye
