program: Orca
programVersion: 5.0.2
elementType: O O O O N C C C C C C C C C C C C C C C C C C C C C C C C H H H H H H H H H H H H H H H H H H H H H H H H H
charge: 0
multiplicity: 1
keywords: wb97x-d3
keywords: def2-TZVPP
keywords: def2/J RIJCOSX
keywords: DEFGRID2
keywords: scfconv7
keywords: smallprint printgap noloewdin
keywords: NOSOSCF
formula: C24H25NO4
InChI: InChI=1/C24H25NO4/c1-23(2)19(21-24(3,4)29-21)20(23)22(26)28-18(14-25)15-9-8-12-17(13-15)27-16-10-6-5-7-11-16/h5-13,18-21H,1-4H3
54 atoms
O  -2.448995 2.511889 -2.150766
O  -1.728948 -1.735439 1.0778
O  -0.809724 0.295489 1.196749
O  3.625891 -0.543391 -0.804385
N  -0.86493 -4.826802 1.836659
C  -3.345609 1.225311 -0.253588
C  -3.712244 1.383938 1.180095
C  -3.14786 0.055329 0.702362
C  -2.182043 1.90468 -0.900148
C  -1.570238 1.397357 -2.131891
C  -2.934617 2.289573 2.103261
C  -5.188728 1.355773 1.504017
C  -1.780634 -0.390228 1.019341
C  -0.125612 1.708912 -2.421866
C  -2.074102 0.14079 -2.794049
C  -0.444388 -2.303668 1.303772
C  0.464716 -2.146798 0.10746
C  -0.695019 -3.715891 1.601181
C  1.642416 -1.43037 0.242906
C  0.096986 -2.677512 -1.122376
C  2.449448 -1.217984 -0.867653
C  0.917295 -2.474251 -2.220015
C  2.085462 -1.737904 -2.102746
C  3.786649 0.53187 0.024537
C  2.767894 1.4373 0.296573
C  5.056793 0.722099 0.550686
C  3.033995 2.532482 1.104287
C  5.309134 1.827241 1.347583
C  4.300078 2.735446 1.632326
H  -4.180276 1.086434 -0.93296
H  -3.860661 -0.755417 0.610299
H  -1.550113 2.497242 -0.241754
H  -3.327849 3.30477 2.02852
H  -3.057059 1.965163 3.137731
H  -1.869367 2.32659 1.899632
H  -5.61556 2.356103 1.415242
H  -5.35941 1.008465 2.524141
H  -5.744481 0.700453 0.832276
H  0.024314 1.888485 -3.488045
H  0.507162 0.866744 -2.138134
H  0.216367 2.592756 -1.88347
H  -3.130851 -0.040579 -2.608288
H  -1.511621 -0.722192 -2.435628
H  -1.933512 0.199604 -3.874969
H  0.025425 -1.853212 2.184746
H  1.914702 -1.016555 1.205386
H  -0.818224 -3.246973 -1.224597
H  0.641355 -2.884828 -3.181947
H  2.72296 -1.567852 -2.960214
H  1.772749 1.296832 -0.104351
H  5.838793 0.008484 0.326878
H  2.237824 3.233732 1.316786
H  6.301667 1.973297 1.752726
H  4.498678 3.593943 2.259211
totalener: -1285.30085595 hartree
nucrepener: 2806.48761023 hartree
electener: -4091.78846618 hartree
oneelecener: -7326.29421036 hartree
twoeener: 3234.50574418 hartree
kineticenergy: 1279.75142523 hartree
xcener: -124.716472290022 hartree
chargesum: 0.0000000
charge: -0.379839 -0.256264 -0.395651 -0.295524 0.001448 -0.129209 0.081595 -0.068995 0.145636 0.213463 -0.272766 -0.235545 0.323350 -0.244363 -0.253641 0.325388 0.057250 -0.255445 -0.151635 -0.241934 0.241086 -0.088582 -0.202201 0.267758 -0.155414 -0.215555 -0.129567 -0.091440 -0.142426 0.092915 0.084663 0.086959 0.096929 0.090287 0.098254 0.093734 0.093058 0.074183 0.099158 0.040322 0.087555 0.089085 0.067219 0.097555 0.114153 0.119384 0.132194 0.133115 0.128186 0.128893 0.125262 0.124268 0.126330 0.125360
qa: -0.3798 -0.2563 -0.3957 -0.2955 0.0014 -0.1292 0.0816 -0.0690 0.1456 0.2135 -0.2728 -0.2355 0.3234 -0.2444 -0.2536 0.3254 0.0572 -0.2554 -0.1516 -0.2419 0.2411 -0.0886 -0.2022 0.2678 -0.1554 -0.2156 -0.1296 -0.0914 -0.1424 0.0929 0.0847 0.0870 0.0969 0.0903 0.0983 0.0937 0.0931 0.0742 0.0992 0.0403 0.0876 0.0891 0.0672 0.0976 0.1142 0.1194 0.1322 0.1331 0.1282 0.1289 0.1253 0.1243 0.1263 0.1254
va: 2.0404 2.1405 2.0893 2.1252 3.1205 3.7972 3.8108 3.8696 3.9966 3.8354 3.9109 3.8986 4.1619 3.9422 3.9391 3.8488 3.5712 4.0211 3.9321 3.9771 3.8481 3.8750 3.9768 3.7775 3.9226 4.0333 3.9942 3.9345 3.9649 1.0197 1.0311 1.0019 0.9991 1.0026 1.0227 1.0039 1.0042 1.0080 1.0144 1.0140 1.0118 1.0118 1.0189 1.0075 1.0187 1.0148 1.0161 0.9982 1.0129 0.9856 1.0144 1.0018 0.9986 1.0004
dispcorr: -0.032146386 hartree
energy: -1285.333002334670
dipole: -14.77650 14.67427 -0.10223 17.76877 -16.84861 0.92015 -3.96612 3.94437 -0.02175
magnitude: 0.92607 au
magnitude: 2.35388 debye
