program: Orca
programVersion: 5.0.2
elementType: O O O O N C C C C C C C C C C C C C C C C C C C C C C C C H H H H H H H H H H H H H H H H H H H H H H H H H
charge: 0
multiplicity: 1
keywords: wb97x-d3
keywords: def2-TZVPP
keywords: def2/J RIJCOSX
keywords: DEFGRID2
keywords: scfconv7
keywords: smallprint printgap noloewdin
keywords: NOSOSCF
formula: C24H25NO4
InChI: InChI=1/C24H25NO4/c1-23(2)19(21-24(3,4)29-21)20(23)22(26)28-18(14-25)15-9-8-12-17(13-15)27-16-10-6-5-7-11-16/h5-13,18-21H,1-4H3
54 atoms
O  -2.069813 3.398693 -1.204014
O  -1.676375 -1.741071 0.543823
O  -1.201288 0.268376 1.41666
O  3.251707 -0.574098 -1.487324
N  -1.26379 -4.543491 2.265779
C  -3.307408 1.424907 -0.398791
C  -4.176524 0.888259 0.68389
C  -3.13881 -0.021518 0.041248
C  -2.252545 2.45997 -0.158979
C  -0.997395 2.51568 -0.909525
C  -4.027062 1.354685 2.111605
C  -5.60791 0.565806 0.323194
C  -1.916495 -0.430911 0.74894
C  0.204036 3.154332 -0.265634
C  -0.675642 1.493869 -1.968294
C  -0.514917 -2.305159 1.145011
C  0.566521 -2.50425 0.110083
C  -0.940343 -3.561626 1.765651
C  1.418051 -1.434956 -0.154527
C  0.684052 -3.690344 -0.597652
C  2.398013 -1.565836 -1.129818
C  1.664139 -3.805527 -1.572923
C  2.521415 -2.755509 -1.840205
C  3.514637 0.486509 -0.667028
C  3.864824 0.321267 0.667499
C  3.492966 1.749395 -1.239085
C  4.17585 1.436653 1.429358
C  3.824784 2.854466 -0.470027
C  4.157436 2.705436 0.867372
H  -3.777704 1.52331 -1.372126
H  -3.532812 -0.777923 -0.626903
H  -2.246361 2.898328 0.837656
H  -3.002844 1.561743 2.407612
H  -4.609186 2.265819 2.259892
H  -4.41983 0.601113 2.795951
H  -6.001496 -0.23003 0.957508
H  -5.708109 0.245143 -0.714367
H  -6.240456 1.444754 0.458782
H  0.824226 3.656692 -1.009797
H  0.822184 2.40261 0.225403
H  -0.087625 3.892015 0.481419
H  -0.09145 1.949176 -2.77014
H  -1.566823 1.056575 -2.415142
H  -0.07629 0.684014 -1.549928
H  -0.147169 -1.650996 1.940929
H  1.306813 -0.511616 0.40069
H  0.027863 -4.525267 -0.390209
H  1.765177 -4.729094 -2.126541
H  3.289808 -2.843659 -2.596834
H  3.901792 -0.666901 1.107911
H  3.224507 1.858264 -2.281714
H  4.444983 1.308298 2.469346
H  3.810978 3.838536 -0.919528
H  4.407117 3.570018 1.466975
totalener: -1285.30209296 hartree
nucrepener: 2787.97673805 hartree
electener: -4073.27883101 hartree
oneelecener: -7289.43465836 hartree
twoeener: 3216.15582736 hartree
kineticenergy: 1279.74302441 hartree
xcener: -124.714913631143 hartree
chargesum: 0.0000000
charge: -0.381547 -0.256187 -0.395830 -0.291795 -0.003600 -0.114615 0.087155 -0.100490 0.133238 0.225839 -0.285528 -0.235322 0.343834 -0.238028 -0.266865 0.309576 0.016583 -0.254898 -0.268314 -0.180510 0.312740 -0.074895 -0.225032 0.288660 -0.206260 -0.216564 -0.094608 -0.115181 -0.131198 0.101327 0.084676 0.084435 0.099178 0.099690 0.092953 0.094194 0.074318 0.091902 0.079453 0.069420 0.086591 0.096166 0.096602 0.066591 0.125737 0.147330 0.123017 0.130727 0.127773 0.136019 0.124374 0.129455 0.129596 0.128119
qa: -0.3815 -0.2562 -0.3958 -0.2918 -0.0036 -0.1146 0.0872 -0.1005 0.1332 0.2258 -0.2855 -0.2353 0.3438 -0.2380 -0.2669 0.3096 0.0166 -0.2549 -0.2683 -0.1805 0.3127 -0.0749 -0.2250 0.2887 -0.2063 -0.2166 -0.0946 -0.1152 -0.1312 0.1013 0.0847 0.0844 0.0992 0.0997 0.0930 0.0942 0.0743 0.0919 0.0795 0.0694 0.0866 0.0962 0.0966 0.0666 0.1257 0.1473 0.1230 0.1307 0.1278 0.1360 0.1244 0.1295 0.1296 0.1281
va: 2.0365 2.1212 2.0907 2.1206 3.1181 3.8219 3.7910 3.8531 3.9876 3.8393 3.9189 3.9001 4.1365 3.9588 3.9549 3.8131 3.7863 4.0283 3.8924 4.0522 3.7525 3.9438 4.0598 3.7336 3.9649 3.9787 3.9337 3.8944 3.9539 1.0210 1.0326 1.0011 1.0187 0.9982 1.0031 1.0041 1.0078 1.0040 1.0045 1.0032 1.0173 1.0087 1.0106 1.0020 1.0288 1.0003 1.0200 0.9991 1.0136 1.0029 1.0171 0.9991 0.9991 0.9998
dispcorr: -0.031687873 hartree
energy: -1285.333780830647
dipole: -12.90546 13.25206 0.34661 18.07277 -17.48983 0.58294 -0.98083 0.59070 -0.39013
magnitude: 0.78241 au
magnitude: 1.98873 debye
