program: Orca
programVersion: 5.0.2
elementType: O O O O N C C C C C C C C C C C C C C C C C C C C C C C C H H H H H H H H H H H H H H H H H H H H H H H H H
charge: 0
multiplicity: 1
keywords: wb97x-d3
keywords: def2-TZVPP
keywords: def2/J RIJCOSX
keywords: DEFGRID2
keywords: scfconv7
keywords: smallprint printgap noloewdin
keywords: NOSOSCF
formula: C24H25NO4
InChI: InChI=1/C24H25NO4/c1-23(2)19(21-24(3,4)29-21)20(23)22(26)28-18(14-25)15-9-8-12-17(13-15)27-16-10-6-5-7-11-16/h5-13,18-21H,1-4H3
54 atoms
O  -2.570497 3.197972 1.194578
O  -1.108241 -1.426149 -0.96372
O  -2.596282 -0.947067 0.634953
O  3.72441 -0.369466 1.007712
N  0.543829 -4.178138 -1.756578
C  -2.940049 1.722726 -0.746424
C  -3.913707 0.885614 -1.498959
C  -2.48252 0.397873 -1.345537
C  -3.002949 1.93023 0.735064
C  -1.805517 2.062166 1.568277
C  -5.060307 0.192783 -0.803813
C  -4.272347 1.34558 -2.893447
C  -2.113762 -0.700149 -0.438198
C  -1.879517 1.679642 3.022497
C  -0.425153 1.973169 0.969833
C  -0.577768 -2.459326 -0.139976
C  0.40425 -1.907718 0.865332
C  0.053509 -3.411185 -1.056695
C  1.621176 -1.396828 0.428949
C  0.064717 -1.869486 2.209649
C  2.50044 -0.846168 1.35095
C  0.957013 -1.325706 3.122455
C  2.168616 -0.80874 2.700653
C  3.91549 0.214656 -0.214767
C  3.071606 1.213679 -0.68264
C  5.019798 -0.181441 -0.952418
C  3.343271 1.813594 -1.901735
C  5.285134 0.434105 -2.166509
C  4.448413 1.429203 -2.647802
H  -2.558483 2.589944 -1.276121
H  -1.865362 0.460709 -2.233822
H  -3.90526 1.564438 1.222583
H  -5.906526 0.877841 -0.728092
H  -5.388098 -0.668431 -1.387973
H  -4.826202 -0.161624 0.195304
H  -5.104617 2.050385 -2.858808
H  -4.573289 0.503063 -3.517948
H  -3.438721 1.844862 -3.388539
H  -2.893526 1.770637 3.410496
H  -1.229151 2.315346 3.626174
H  -1.556043 0.64681 3.153281
H  -0.410595 2.226743 -0.089251
H  -0.02477 0.964866 1.086009
H  0.252824 2.655325 1.486859
H  -1.381964 -2.986052 0.38316
H  1.887995 -1.440354 -0.62062
H  -0.891573 -2.250692 2.540752
H  0.700407 -1.293305 4.172784
H  2.866819 -0.380126 3.40732
H  2.215823 1.527781 -0.09842
H  5.66522 -0.961825 -0.571626
H  2.688404 2.594391 -2.265145
H  6.148586 0.125789 -2.740733
H  4.65664 1.904357 -3.59667
totalener: -1285.30242583 hartree
nucrepener: 2796.62005004 hartree
electener: -4081.92247587 hartree
oneelecener: -7306.64836648 hartree
twoeener: 3224.72589061 hartree
kineticenergy: 1279.74903511 hartree
xcener: -124.715543083887 hartree
chargesum: -0.0000000
charge: -0.380939 -0.254840 -0.390369 -0.296746 0.000600 -0.109777 0.090110 -0.097357 0.104207 0.236183 -0.281069 -0.236913 0.326519 -0.238920 -0.255995 0.336598 0.001984 -0.268699 -0.142746 -0.152556 0.195811 -0.110506 -0.177765 0.165729 -0.094007 -0.160740 -0.170753 -0.113072 -0.112269 0.100905 0.086109 0.086591 0.097591 0.090709 0.100521 0.093250 0.093064 0.073905 0.083990 0.089119 0.077767 0.099376 0.015100 0.111777 0.118715 0.130730 0.122464 0.132132 0.130222 0.148758 0.127611 0.124023 0.127162 0.126708
qa: -0.3809 -0.2548 -0.3904 -0.2967 0.0006 -0.1098 0.0901 -0.0974 0.1042 0.2362 -0.2811 -0.2369 0.3265 -0.2389 -0.2560 0.3366 0.0020 -0.2687 -0.1427 -0.1526 0.1958 -0.1105 -0.1778 0.1657 -0.0940 -0.1607 -0.1708 -0.1131 -0.1123 0.1009 0.0861 0.0866 0.0976 0.0907 0.1005 0.0933 0.0931 0.0739 0.0840 0.0891 0.0778 0.0994 0.0151 0.1118 0.1187 0.1307 0.1225 0.1321 0.1302 0.1488 0.1276 0.1240 0.1272 0.1267
va: 2.0364 2.1388 2.0973 2.1148 3.1203 3.8102 3.7865 3.8482 4.0262 3.8621 3.9143 3.9003 4.1572 3.9308 3.9511 3.8335 3.6129 4.0343 3.9145 3.9173 3.8771 3.9273 4.0010 3.8873 3.8961 4.0125 4.0133 3.9537 3.9426 1.0211 1.0317 1.0016 0.9982 1.0034 1.0194 1.0040 1.0045 1.0076 1.0163 1.0059 1.0108 1.0043 1.0253 1.0049 1.0195 1.0167 1.0192 0.9986 1.0108 0.9787 1.0123 1.0037 0.9993 1.0000
dispcorr: -0.032104573 hartree
energy: -1285.334530405763
dipole: -17.76316 17.44078 -0.32238 15.80261 -15.12998 0.67263 -0.53750 0.64701 0.10952
magnitude: 0.75390 au
magnitude: 1.91625 debye
