program: Orca
programVersion: 5.0.2
elementType: O O O O N C C C C C C C C C C C C C C C C C C C C C C C C H H H H H H H H H H H H H H H H H H H H H H H H H
charge: 0
multiplicity: 1
keywords: wb97x-d3
keywords: def2-TZVPP
keywords: def2/J RIJCOSX
keywords: DEFGRID2
keywords: scfconv7
keywords: smallprint printgap noloewdin
keywords: NOSOSCF
formula: C24H25NO4
InChI: InChI=1/C24H25NO4/c1-23(2)19(21-24(3,4)29-21)20(23)22(26)28-18(14-25)15-9-8-12-17(13-15)27-16-10-6-5-7-11-16/h5-13,18-21H,1-4H3
54 atoms
O  -2.484784 2.809568 -1.974667
O  -1.755204 -1.702107 0.845888
O  -1.239476 0.447219 1.193884
O  3.78921 -0.833973 -0.929853
N  -0.644144 -4.466272 2.290004
C  -3.616152 1.153066 -0.540183
C  -4.318093 0.881497 0.744241
C  -3.340842 -0.147714 0.200745
C  -2.590016 2.233946 -0.68518
C  -1.363005 2.099987 -1.471975
C  -3.996343 1.670964 1.989592
C  -5.772653 0.480698 0.663526
C  -2.017301 -0.379559 0.800628
C  -0.177981 2.94871 -1.090866
C  -1.018196 0.823986 -2.193472
C  -0.446166 -2.0798 1.244052
C  0.496915 -2.091617 0.063866
C  -0.572741 -3.418935 1.824194
C  1.693571 -1.394401 0.132258
C  0.158437 -2.808429 -1.077498
C  2.570445 -1.433268 -0.94762
C  1.034095 -2.827827 -2.149392
C  2.23779 -2.144194 -2.092225
C  3.972026 0.303579 -0.190566
C  3.204725 1.43564 -0.427709
C  4.97609 0.314153 0.763989
C  3.448546 2.585969 0.304958
C  5.217159 1.475279 1.484415
C  4.453622 2.610971 1.262212
H  -4.208895 1.015172 -1.439194
H  -3.791309 -1.039867 -0.217628
H  -2.570862 2.960248 0.127051
H  -4.266936 1.097195 2.877295
H  -2.948734 1.942922 2.083629
H  -4.584331 2.590471 2.00288
H  -6.411365 1.365476 0.668396
H  -6.0560 -0.141046 1.514075
H  -5.993495 -0.078774 -0.246161
H  0.455056 3.155696 -1.956913
H  0.421158 2.430718 -0.341084
H  -0.491068 3.904372 -0.670431
H  -0.292153 0.240416 -1.625645
H  -0.567673 1.051467 -3.161657
H  -1.889447 0.195996 -2.374732
H  -0.06592 -1.409703 2.021484
H  1.943145 -0.831339 1.023273
H  -0.77553 -3.352531 -1.128214
H  0.779343 -3.382241 -3.042547
H  2.927077 -2.161932 -2.925945
H  2.429736 1.419038 -1.18394
H  5.56564 -0.57752 0.931646
H  2.850955 3.469062 0.120683
H  6.003949 1.487008 2.227104
H  4.642422 3.512772 1.828569
totalener: -1285.30117645 hartree
nucrepener: 2783.55931541 hartree
electener: -4068.86049187 hartree
oneelecener: -7280.51008485 hartree
twoeener: 3211.64959298 hartree
kineticenergy: 1279.74608338 hartree
xcener: -124.713480942303 hartree
chargesum: 0.0000000
charge: -0.380179 -0.261610 -0.385878 -0.297004 0.000604 -0.094481 0.097049 -0.117393 0.091636 0.278322 -0.288745 -0.236439 0.323571 -0.305358 -0.251224 0.326831 -0.015626 -0.253599 -0.090374 -0.186329 0.185438 -0.094689 -0.167994 0.203841 -0.146320 -0.182586 -0.122004 -0.106815 -0.132050 0.104390 0.085813 0.081967 0.092452 0.100966 0.098592 0.092241 0.093585 0.074546 0.095584 0.083217 0.091223 0.035508 0.104847 0.094485 0.117348 0.116778 0.122993 0.129156 0.129811 0.146167 0.129248 0.132508 0.127861 0.128117
qa: -0.3802 -0.2616 -0.3859 -0.2970 0.0006 -0.0945 0.0970 -0.1174 0.0916 0.2783 -0.2887 -0.2364 0.3236 -0.3054 -0.2512 0.3268 -0.0156 -0.2536 -0.0904 -0.1863 0.1854 -0.0947 -0.1680 0.2038 -0.1463 -0.1826 -0.1220 -0.1068 -0.1321 0.1044 0.0858 0.0820 0.0925 0.1010 0.0986 0.0922 0.0936 0.0745 0.0956 0.0832 0.0912 0.0355 0.1048 0.0945 0.1173 0.1168 0.1230 0.1292 0.1298 0.1462 0.1292 0.1325 0.1279 0.1281
va: 2.0360 2.1246 2.0977 2.1123 3.1208 3.8265 3.7718 3.8538 4.0150 3.7778 3.9180 3.9008 4.1658 3.9573 3.9413 3.8238 3.6793 4.0282 3.8505 3.9955 3.8902 3.9504 4.0090 3.8698 3.9618 4.0202 3.9647 3.9389 3.9783 1.0208 1.0315 0.9984 1.0036 1.0165 0.9977 1.0040 1.0043 1.0077 0.9958 1.0019 1.0199 1.0215 1.0100 1.0096 1.0294 1.0171 1.0183 0.9992 1.0115 0.9879 1.0115 0.9995 0.9989 1.0002
dispcorr: -0.031874666 hartree
energy: -1285.333051117598
dipole: -15.74459 15.67259 -0.07200 17.95192 -17.05680 0.89513 -2.62904 2.41150 -0.21754
magnitude: 0.92399 au
magnitude: 2.34859 debye
