program: Orca
programVersion: 5.0.2
elementType: O O O O N C C C C C C C C C C C C C C C C C C C C C C C C H H H H H H H H H H H H H H H H H H H H H H H H H
charge: 0
multiplicity: 1
keywords: wb97x-d3
keywords: def2-TZVPP
keywords: def2/J RIJCOSX
keywords: DEFGRID2
keywords: scfconv7
keywords: smallprint printgap noloewdin
keywords: NOSOSCF
formula: C24H25NO4
InChI: InChI=1/C24H25NO4/c1-23(2)19(21-24(3,4)29-21)20(23)22(26)28-18(14-25)15-9-8-12-17(13-15)27-16-10-6-5-7-11-16/h5-13,18-21H,1-4H3
54 atoms
O  -1.986693 3.125068 -1.088179
O  -2.13298 -1.991692 0.496889
O  -1.735486 -0.072837 1.57478
O  3.109225 -0.0597 0.796992
N  -1.449946 -5.146586 1.195839
C  -3.486331 1.265655 -0.480843
C  -4.51949 0.785624 0.477009
C  -3.487613 -0.196383 -0.053604
C  -2.38263 2.199692 -0.092475
C  -1.041814 2.146628 -0.679546
C  -4.516747 1.222662 1.921506
C  -5.915121 0.586339 -0.068323
C  -2.376641 -0.695755 0.77086
C  0.121288 2.671616 0.120092
C  -0.680338 1.113188 -1.715046
C  -0.999781 -2.573723 1.133004
C  0.268104 -2.24659 0.381563
C  -1.260648 -4.014582 1.159654
C  1.140764 -1.30357 0.900593
C  0.525997 -2.83469 -0.851343
C  2.287095 -0.957094 0.195382
C  1.672803 -2.48526 -1.542876
C  2.561898 -1.55265 -1.028881
C  3.919281 0.763242 0.065955
C  5.214467 0.945016 0.526462
C  3.463308 1.452674 -1.050878
C  6.055517 1.829895 -0.130513
C  4.317774 2.32791 -1.703057
C  5.614269 2.52155 -1.248423
H  -3.824613 1.416297 -1.501231
H  -3.850312 -0.910908 -0.782831
H  -2.462075 2.62822 0.905414
H  -5.038851 2.176581 2.014022
H  -5.053245 0.496165 2.533788
H  -3.525859 1.340852 2.34941
H  -6.484308 1.514966 -0.001883
H  -6.451976 -0.176244 0.498004
H  -5.906746 0.279634 -1.114854
H  -0.197729 3.414059 0.851061
H  0.864668 3.141288 -0.526815
H  0.611363 1.860393 0.659196
H  -1.548362 0.735604 -2.253132
H  -0.172767 0.263968 -1.25421
H  0.001266 1.542035 -2.453084
H  -0.918673 -2.230144 2.16878
H  0.937147 -0.824002 1.849237
H  -0.151694 -3.571514 -1.2631
H  1.888575 -2.951204 -2.494856
H  3.460065 -1.302004 -1.577581
H  5.550849 0.402764 1.400237
H  2.449195 1.317138 -1.404409
H  7.063855 1.973897 0.234106
H  3.960733 2.868089 -2.569945
H  6.273293 3.209971 -1.759451
totalener: -1285.30239099 hartree
nucrepener: 2773.91212191 hartree
electener: -4059.21451290 hartree
oneelecener: -7261.23866545 hartree
twoeener: 3202.02415255 hartree
kineticenergy: 1279.74638551 hartree
xcener: -124.715422820428 hartree
chargesum: -0.0000000
charge: -0.381342 -0.254088 -0.395226 -0.297033 -0.001673 -0.123551 0.093830 -0.101259 0.116701 0.254403 -0.283998 -0.236366 0.337568 -0.258489 -0.262066 0.326868 -0.006748 -0.260617 -0.178787 -0.150450 0.216203 -0.114483 -0.154030 0.262057 -0.194320 -0.172505 -0.100764 -0.141523 -0.127171 0.101115 0.084308 0.087017 0.098622 0.090459 0.100181 0.092710 0.093041 0.074331 0.088598 0.085725 0.078772 0.105568 0.036343 0.099778 0.119505 0.123410 0.121120 0.131606 0.135170 0.127087 0.132600 0.127467 0.126852 0.127473
qa: -0.3813 -0.2541 -0.3952 -0.2970 -0.0017 -0.1236 0.0938 -0.1013 0.1167 0.2544 -0.2840 -0.2364 0.3376 -0.2585 -0.2621 0.3269 -0.0067 -0.2606 -0.1788 -0.1505 0.2162 -0.1145 -0.1540 0.2621 -0.1943 -0.1725 -0.1008 -0.1415 -0.1272 0.1011 0.0843 0.0870 0.0986 0.0905 0.1002 0.0927 0.0930 0.0743 0.0886 0.0857 0.0788 0.1056 0.0363 0.0998 0.1195 0.1234 0.1211 0.1316 0.1352 0.1271 0.1326 0.1275 0.1269 0.1275
va: 2.0398 2.1352 2.0901 2.1013 3.1193 3.8316 3.7788 3.8624 3.9960 3.7867 3.9158 3.8998 4.1469 3.9452 3.9504 3.8318 3.6483 4.0225 3.9478 4.0175 3.8822 3.9632 3.9374 3.7536 4.0461 3.9298 3.9435 3.9990 3.9532 1.0213 1.0323 1.0015 0.9980 1.0034 1.0195 1.0039 1.0043 1.0077 1.0188 1.0049 1.0089 1.0090 1.0219 1.0058 1.0200 1.0322 1.0163 1.0009 1.0030 1.0136 0.9895 0.9988 1.0023 0.9999
dispcorr: -0.032293539 hartree
energy: -1285.334684530311
dipole: -11.86937 12.23004 0.36067 17.54888 -16.71061 0.83827 -5.34626 4.80529 -0.54098
magnitude: 1.06086 au
magnitude: 2.69649 debye
