program: Orca
programVersion: 5.0.2
elementType: O O O O N C C C C C C C C C C C C C C C C C C C C C C C C H H H H H H H H H H H H H H H H H H H H H H H H H
charge: 0
multiplicity: 1
keywords: wb97x-d3
keywords: def2-TZVPP
keywords: def2/J RIJCOSX
keywords: DEFGRID2
keywords: scfconv7
keywords: smallprint printgap noloewdin
keywords: NOSOSCF
formula: C24H25NO4
InChI: InChI=1/C24H25NO4/c1-23(2)19(21-24(3,4)29-21)20(23)22(26)28-18(14-25)15-9-8-12-17(13-15)27-16-10-6-5-7-11-16/h5-13,18-21H,1-4H3
54 atoms
O  -2.896538 3.172981 -0.970831
O  -1.788603 -1.908296 0.219389
O  -2.661315 -0.244821 1.431406
O  3.052332 -0.514999 -0.975542
N  -0.154657 -4.676906 1.002915
C  -3.727494 0.859864 -1.171668
C  -4.812421 -0.092285 -0.810796
C  -3.374369 -0.583865 -0.831639
C  -3.305414 1.997671 -0.294631
C  -1.920616 2.467709 -0.218379
C  -5.57835 0.040273 0.482868
C  -5.668586 -0.609919 -1.944221
C  -2.611461 -0.855096 0.396839
C  -1.45125 3.151215 1.03882
C  -0.826832 1.805543 -1.014529
C  -0.885484 -2.184679 1.283921
C  0.301193 -1.251476 1.246946
C  -0.482474 -3.58167 1.110551
C  1.194502 -1.31826 0.186765
C  0.464454 -0.29786 2.241854
C  2.250982 -0.421124 0.116114
C  1.526478 0.589521 2.164329
C  2.419646 0.541771 1.106689
C  4.337441 -0.047042 -0.919886
C  5.23648 -0.527248 0.023549
C  4.734147 0.8825 -1.867749
C  6.541363 -0.061707 0.013743
C  6.046395 1.332458 -1.873344
C  6.951805 0.868353 -0.931562
H  -3.634409 1.087681 -2.228804
H  -3.106349 -1.221179 -1.665812
H  -3.937519 2.180865 0.572699
H  -4.979865 0.386107 1.320095
H  -6.403611 0.741336 0.346621
H  -6.009561 -0.921878 0.763687
H  -5.110174 -0.688827 -2.877711
H  -6.510759 0.06111 -2.120609
H  -6.07048 -1.597454 -1.712258
H  -0.9824 2.425568 1.70377
H  -2.276411 3.620232 1.574022
H  -0.714717 3.923815 0.810763
H  -1.200688 1.295007 -1.900274
H  -0.295778 1.077458 -0.400881
H  -0.096223 2.547474 -1.341498
H  -1.390286 -2.100452 2.251285
H  1.081475 -2.061895 -0.593251
H  -0.240105 -0.236197 3.060001
H  1.656285 1.340656 2.93187
H  3.234518 1.251512 1.054983
H  4.921143 -1.261818 0.753973
H  4.020109 1.240246 -2.597919
H  7.243672 -0.435856 0.746953
H  6.358171 2.054046 -2.616812
H  7.972901 1.224612 -0.936284
totalener: -1285.30251400 hartree
nucrepener: 2729.35590777 hartree
electener: -4014.65842177 hartree
oneelecener: -7172.31740834 hartree
twoeener: 3157.65898657 hartree
kineticenergy: 1279.74578298 hartree
xcener: -124.714377357503 hartree
chargesum: 0.0000000
charge: -0.380479 -0.257887 -0.389657 -0.295267 -0.000292 -0.114923 0.092620 -0.094371 0.111242 0.219971 -0.281962 -0.237120 0.324357 -0.243931 -0.212250 0.341657 0.014389 -0.268139 -0.195279 -0.146640 0.212916 -0.134625 -0.139296 0.210738 -0.150292 -0.184456 -0.119234 -0.104380 -0.129181 0.100090 0.084989 0.087695 0.099823 0.097858 0.089824 0.074486 0.092699 0.093148 0.079582 0.083395 0.088343 0.094226 0.011983 0.097758 0.118899 0.119062 0.120394 0.134353 0.135063 0.136374 0.126690 0.129378 0.127484 0.128176
qa: -0.3805 -0.2579 -0.3897 -0.2953 -0.0003 -0.1149 0.0926 -0.0944 0.1112 0.2200 -0.2820 -0.2371 0.3244 -0.2439 -0.2122 0.3417 0.0144 -0.2681 -0.1953 -0.1466 0.2129 -0.1346 -0.1393 0.2107 -0.1503 -0.1845 -0.1192 -0.1044 -0.1292 0.1001 0.0850 0.0877 0.0998 0.0979 0.0898 0.0745 0.0927 0.0931 0.0796 0.0834 0.0883 0.0942 0.0120 0.0978 0.1189 0.1191 0.1204 0.1344 0.1351 0.1364 0.1267 0.1294 0.1275 0.1282
va: 2.0379 2.1370 2.0980 2.1036 3.1210 3.8271 3.7829 3.8595 4.0058 3.8471 3.9145 3.8997 4.1571 3.9363 3.9275 3.8257 3.6269 4.0317 4.0351 3.9286 3.8575 3.9396 3.8959 3.8332 3.9599 4.0311 3.9415 3.9399 3.9491 1.0211 1.0321 1.0012 1.0200 0.9981 1.0034 1.0076 1.0040 1.0043 1.0087 1.0163 1.0061 1.0108 1.0366 1.0112 1.0187 1.0311 1.0190 0.9998 1.0048 1.0022 1.0123 0.9996 0.9992 0.9997
dispcorr: -0.030781968 hartree
energy: -1285.333295968457
dipole: -15.57310 15.90126 0.32816 15.46282 -14.49834 0.96448 -2.94470 3.10212 0.15742
magnitude: 1.03087 au
magnitude: 2.62026 debye
