program: Orca
programVersion: 5.0.2
elementType: O O O O N C C C C C C C C C C C C C C C C C C C C C C C C H H H H H H H H H H H H H H H H H H H H H H H H H
charge: 0
multiplicity: 1
keywords: wb97x-d3
keywords: def2-TZVPP
keywords: def2/J RIJCOSX
keywords: DEFGRID2
keywords: scfconv7
keywords: smallprint printgap noloewdin
keywords: NOSOSCF
formula: C24H25NO4
InChI: InChI=1/C24H25NO4/c1-23(2)19(21-24(3,4)29-21)20(23)22(26)28-18(14-25)15-9-8-12-17(13-15)27-16-10-6-5-7-11-16/h5-13,18-21H,1-4H3
54 atoms
O  -2.45173 2.552475 -2.137774
O  -1.731246 -1.686503 1.008431
O  -1.137732 0.45861 1.212616
O  3.13107 0.022963 -1.359279
N  -0.557529 -4.471497 2.357122
C  -3.554027 1.121905 -0.458419
C  -4.168144 1.058349 0.895276
C  -3.321899 -0.1083 0.411275
C  -2.433687 2.049735 -0.814122
C  -1.384987 1.69004 -1.770721
C  -3.702202 1.953907 2.016681
C  -5.651277 0.77289 0.956622
C  -1.965655 -0.362668 0.920244
C  -0.033859 2.342929 -1.648955
C  -1.367241 0.340798 -2.440101
C  -0.401708 -2.068216 1.344904
C  0.490868 -2.037873 0.12706
C  -0.504202 -3.416534 1.906877
C  1.433874 -1.026703 0.003798
C  0.318418 -2.970887 -0.887362
C  2.219773 -0.959243 -1.141299
C  1.101109 -2.886117 -2.027229
C  2.052916 -1.889078 -2.15934
C  3.699524 0.684137 -0.304375
C  4.358406 -0.001458 0.708054
C  3.648513 2.068842 -0.304969
C  4.960817 0.713967 1.730569
C  4.264863 2.773228 0.718855
C  4.916586 2.101299 1.741355
H  -4.228483 0.940902 -1.289434
H  -3.86563 -1.0036 0.134435
H  -2.180889 2.792844 -0.059598
H  -2.634773 2.151974 2.013906
H  -4.22234 2.911546 1.957138
H  -3.950157 1.506573 2.980501
H  -5.917207 0.281926 1.894041
H  -5.979806 0.12963 0.139382
H  -6.21996 1.702008 0.892929
H  0.615437 1.739819 -1.014504
H  -0.107766 3.337091 -1.208747
H  0.444098 2.438814 -2.625785
H  -0.69335 -0.338509 -1.916732
H  -1.0010 0.433617 -3.464116
H  -2.351882 -0.121718 -2.480925
H  0.003694 -1.413227 2.122189
H  1.535767 -0.286958 0.787253
H  -0.413834 -3.762079 -0.789027
H  0.97627 -3.610376 -2.820751
H  2.668372 -1.822253 -3.046704
H  4.404285 -1.083123 0.695491
H  3.135581 2.585498 -1.105624
H  5.47404 0.181364 2.520127
H  4.22737 3.8544 0.717293
H  5.39103 2.654341 2.540475
totalener: -1285.30262036 hartree
nucrepener: 2801.78330333 hartree
electener: -4087.08592369 hartree
oneelecener: -7317.11663612 hartree
twoeener: 3230.03071243 hartree
kineticenergy: 1279.75403123 hartree
xcener: -124.716941196042 hartree
chargesum: -0.0000000
charge: -0.380986 -0.254519 -0.395524 -0.290936 -0.000970 -0.117013 0.090097 -0.097840 0.117444 0.217693 -0.282128 -0.236250 0.333865 -0.236324 -0.216977 0.324309 -0.017365 -0.260213 -0.125924 -0.166141 0.213673 -0.081676 -0.213422 0.236301 -0.170824 -0.193279 -0.111586 -0.100465 -0.136453 0.100740 0.084477 0.086774 0.100259 0.097563 0.090007 0.092919 0.074426 0.092538 0.056912 0.088310 0.094693 0.021122 0.099275 0.093613 0.118283 0.129882 0.119139 0.128768 0.128304 0.133893 0.136543 0.129740 0.127676 0.127576
qa: -0.3810 -0.2545 -0.3955 -0.2909 -0.0010 -0.1170 0.0901 -0.0978 0.1174 0.2177 -0.2821 -0.2362 0.3339 -0.2363 -0.2170 0.3243 -0.0174 -0.2602 -0.1259 -0.1661 0.2137 -0.0817 -0.2134 0.2363 -0.1708 -0.1933 -0.1116 -0.1005 -0.1365 0.1007 0.0845 0.0868 0.1003 0.0976 0.0900 0.0929 0.0744 0.0925 0.0569 0.0883 0.0947 0.0211 0.0993 0.0936 0.1183 0.1299 0.1191 0.1288 0.1283 0.1339 0.1365 0.1297 0.1277 0.1276
va: 2.0397 2.1373 2.0877 2.0949 3.1209 3.8273 3.7836 3.8614 3.9997 3.8886 3.9149 3.9000 4.1479 3.9408 3.9379 3.8366 3.6706 4.0223 3.8086 4.0112 3.8114 3.9333 4.0475 3.8160 3.9663 4.0231 3.9409 3.9562 3.9661 1.0209 1.0318 1.0014 1.0201 0.9982 1.0031 1.0042 1.0077 1.0040 1.0092 1.0158 1.0035 1.0289 1.0112 1.0103 1.0215 1.0243 1.0169 0.9999 1.0139 1.0041 1.0046 0.9994 0.9999 1.0000
dispcorr: -0.032365748 hartree
energy: -1285.334986107376
dipole: -14.12158 14.26037 0.13879 15.27727 -14.58019 0.69708 -2.54977 2.48402 -0.06574
magnitude: 0.71379 au
magnitude: 1.81432 debye
