program: Orca
programVersion: 5.0.2
elementType: O O O O N C C C C C C C C C C C C C C C C C C C C C C C C H H H H H H H H H H H H H H H H H H H H H H H H H
charge: 0
multiplicity: 1
keywords: wb97x-d3
keywords: def2-TZVPP
keywords: def2/J RIJCOSX
keywords: DEFGRID2
keywords: scfconv7
keywords: smallprint printgap noloewdin
keywords: NOSOSCF
formula: C24H25NO4
InChI: InChI=1/C24H25NO4/c1-23(2)19(21-24(3,4)29-21)20(23)22(26)28-18(14-25)15-9-8-12-17(13-15)27-16-10-6-5-7-11-16/h5-13,18-21H,1-4H3
54 atoms
O  -1.689151 2.968227 2.520482
O  -1.365546 -1.055101 -1.037927
O  -2.316289 -0.844669 0.975242
O  3.747554 -0.554128 -0.099131
N  -0.322571 -3.64846 -2.812572
C  -2.580863 2.103104 0.389864
C  -3.777746 1.590077 -0.331069
C  -2.422061 0.957664 -0.60157
C  -2.365842 1.913294 1.859677
C  -1.044261 1.70516 2.453799
C  -4.862434 0.828235 0.390566
C  -4.310142 2.437042 -1.463605
C  -2.062797 -0.378876 -0.103367
C  -0.940304 0.958414 3.757402
C  0.194738 1.644379 1.599434
C  -0.81759 -2.301227 -0.629438
C  0.438419 -2.103374 0.184308
C  -0.544812 -3.041219 -1.863388
C  1.50869 -1.417405 -0.381287
C  0.502243 -2.56546 1.487255
C  2.652539 -1.201187 0.372321
C  1.658435 -2.353101 2.22722
C  2.729261 -1.673075 1.68044
C  3.629202 0.220056 -1.225437
C  3.033476 1.470558 -1.143385
C  4.143564 -0.246903 -2.423512
C  2.962288 2.262812 -2.278386
C  4.067882 0.555946 -3.553192
C  3.476844 1.808324 -3.484893
H  -2.180419 3.044119 0.025746
H  -1.973074 1.205766 -1.555925
H  -3.21941 1.519281 2.409522
H  -5.412747 0.202488 -0.313898
H  -4.498176 0.182658 1.184406
H  -5.573573 1.530617 0.828973
H  -5.029871 3.166993 -1.089266
H  -4.815738 1.820505 -2.208664
H  -3.516848 2.987378 -1.970995
H  -0.110734 1.335637 4.358254
H  -0.765467 -0.100962 3.567975
H  -1.851861 1.052652 4.346738
H  0.071005 2.151343 0.64326
H  0.470704 0.607862 1.401447
H  1.033374 2.11091 2.120813
H  -1.546753 -2.875424 -0.049229
H  1.44644 -1.06126 -1.402493
H  -0.342984 -3.077509 1.927314
H  1.719442 -2.711964 3.245829
H  3.629474 -1.499193 2.254978
H  2.64046 1.821047 -0.19722
H  4.602194 -1.225963 -2.46698
H  2.506259 3.242064 -2.217903
H  4.469778 0.195782 -4.490762
H  3.420806 2.430822 -4.367616
totalener: -1285.30229706 hartree
nucrepener: 2807.19831006 hartree
electener: -4092.50060712 hartree
oneelecener: -7327.95060723 hartree
twoeener: 3235.45000011 hartree
kineticenergy: 1279.74908566 hartree
xcener: -124.713963449498 hartree
chargesum: 0.0000000
charge: -0.380572 -0.261854 -0.384270 -0.294871 -0.000123 -0.106125 0.092376 -0.094488 0.099474 0.240012 -0.284414 -0.236405 0.314404 -0.238525 -0.265443 0.342828 0.015639 -0.265081 -0.180460 -0.161024 0.219957 -0.083782 -0.191817 0.177648 -0.129875 -0.149282 -0.143934 -0.120075 -0.107660 0.100164 0.086102 0.086378 0.090889 0.099771 0.098827 0.092057 0.093791 0.073724 0.088209 0.080945 0.081402 0.094262 0.032325 0.108655 0.118316 0.124957 0.112548 0.128832 0.127739 0.144760 0.128731 0.127111 0.129070 0.128177
qa: -0.3806 -0.2619 -0.3843 -0.2949 -0.0001 -0.1061 0.0924 -0.0945 0.0995 0.2400 -0.2844 -0.2364 0.3144 -0.2385 -0.2654 0.3428 0.0156 -0.2651 -0.1805 -0.1610 0.2200 -0.0838 -0.1918 0.1776 -0.1299 -0.1493 -0.1439 -0.1201 -0.1077 0.1002 0.0861 0.0864 0.0909 0.0998 0.0988 0.0921 0.0938 0.0737 0.0882 0.0809 0.0814 0.0943 0.0323 0.1087 0.1183 0.1250 0.1125 0.1288 0.1277 0.1448 0.1287 0.1271 0.1291 0.1282
va: 2.0363 2.1350 2.1044 2.1147 3.1225 3.8149 3.7846 3.8439 4.0289 3.8732 3.9166 3.8999 4.1769 3.9357 3.9489 3.8269 3.6458 4.0351 3.9012 3.9612 3.8493 3.9347 4.0114 3.8765 3.9812 4.0050 3.9745 3.9474 3.9363 1.0217 1.0314 1.0012 1.0035 1.0186 0.9980 1.0041 1.0040 1.0076 1.0054 1.0075 1.0156 1.0033 1.0253 1.0060 1.0215 1.0271 1.0170 0.9989 1.0129 0.9942 1.0098 1.0019 0.9996 0.9995
dispcorr: -0.032035996 hartree
energy: -1285.334333057025
dipole: -15.00891 14.85753 -0.15138 16.11952 -15.46941 0.65011 7.59376 -7.40298 0.19078
magnitude: 0.69423 au
magnitude: 1.76459 debye
