program: Orca
programVersion: 5.0.2
elementType: O O O O N C C C C C C C C C C C C C C C C C C C C C C C C H H H H H H H H H H H H H H H H H H H H H H H H H
charge: 0
multiplicity: 1
keywords: wb97x-d3
keywords: def2-TZVPP
keywords: def2/J RIJCOSX
keywords: DEFGRID2
keywords: scfconv7
keywords: smallprint printgap noloewdin
keywords: NOSOSCF
formula: C24H25NO4
InChI: InChI=1/C24H25NO4/c1-23(2)19(21-24(3,4)29-21)20(23)22(26)28-18(14-25)15-9-8-12-17(13-15)27-16-10-6-5-7-11-16/h5-13,18-21H,1-4H3
54 atoms
O  -2.604114 2.197988 -2.180024
O  -1.765039 -1.060339 0.38958
O  -3.660986 -2.194234 0.658608
O  2.890478 0.407902 -0.633565
N  -1.507805 -3.433706 -2.003833
C  -3.389749 1.41373 0.017104
C  -3.142429 1.388134 1.485475
C  -3.744602 0.16222 0.811981
C  -2.305351 1.436157 -1.015215
C  -2.442431 0.786932 -2.323411
C  -1.747003 1.395999 2.062934
C  -4.120209 2.149016 2.352207
C  -3.084662 -1.135198 0.620591
C  -1.209468 0.373802 -3.081049
C  -3.686477 0.016971 -2.676648
C  -1.052419 -2.280193 0.301223
C  0.421649 -2.000053 0.460435
C  -1.320255 -2.918418 -0.994303
C  1.007187 -0.899164 -0.151877
C  1.185826 -2.865342 1.229956
C  2.364723 -0.670623 0.014209
C  2.546097 -2.632946 1.372796
C  3.145261 -1.540431 0.768958
C  3.909144 1.11676 -0.050651
C  3.850049 1.516439 1.27885
C  4.983701 1.471734 -0.852007
C  4.890108 2.26776 1.805928
C  6.011696 2.23395 -0.314109
C  5.973818 2.628226 1.015714
H  -4.272684 1.962591 -0.295364
H  -4.805176 0.02218 0.984575
H  -1.293621 1.590274 -0.641783
H  -1.718042 0.840703 3.002098
H  -0.977713 0.985406 1.415474
H  -1.460956 2.425763 2.285394
H  -4.162086 1.724708 3.357226
H  -5.130498 2.133271 1.941591
H  -3.815487 3.19334 2.444226
H  -0.997847 -0.684647 -2.926787
H  -0.3313 0.942893 -2.77355
H  -1.350372 0.523883 -4.153796
H  -3.892882 0.097826 -3.745998
H  -4.56751 0.36665 -2.139994
H  -3.553872 -1.042814 -2.453105
H  -1.371885 -2.979844 1.07922
H  0.42573 -0.213679 -0.756133
H  0.724735 -3.715944 1.715489
H  3.147788 -3.309539 1.964962
H  4.208278 -1.373602 0.88715
H  3.003901 1.249776 1.900263
H  5.013371 1.156649 -1.887497
H  4.846733 2.577534 2.842166
H  6.849916 2.511549 -0.940075
H  6.780843 3.215338 1.433828
elementType: O N C H
totalener: -1285.32575781 hartree
nucrepener: 2756.42641349 hartree
electener: -4041.75217130 hartree
oneelecener: -7226.09962185 hartree
twoeener: 3184.34745055 hartree
cpcmener: -0.03751066 hartree
kineticenergy: 1279.67849667 hartree
xcener: -124.707053050768 hartree
chargesum: -0.0000000
charge: -0.457300 -0.263908 -0.442232 -0.329221 -0.087256 -0.105776 0.102188 -0.121930 0.118663 0.220259 -0.268083 -0.262413 0.396989 -0.282707 -0.275649 0.366033 0.067197 -0.229829 -0.229822 -0.190068 0.204979 -0.135245 -0.163226 0.264319 -0.178541 -0.237128 -0.149229 -0.126733 -0.176822 0.105686 0.093184 0.123303 0.106073 0.071489 0.101063 0.097192 0.088737 0.095706 0.088156 0.094157 0.110057 0.108730 0.101080 0.088145 0.133931 0.122153 0.143424 0.159310 0.157813 0.160277 0.146861 0.159200 0.158035 0.158728
qa: -0.4573 -0.2639 -0.4422 -0.3292 -0.0873 -0.1058 0.1022 -0.1219 0.1187 0.2203 -0.2681 -0.2624 0.3970 -0.2827 -0.2756 0.3660 0.0672 -0.2298 -0.2298 -0.1901 0.2050 -0.1352 -0.1632 0.2643 -0.1785 -0.2371 -0.1492 -0.1267 -0.1768 0.1057 0.0932 0.1233 0.1061 0.0715 0.1011 0.0972 0.0887 0.0957 0.0882 0.0942 0.1101 0.1087 0.1011 0.0881 0.1339 0.1222 0.1434 0.1593 0.1578 0.1603 0.1469 0.1592 0.1580 0.1587
va: 1.9420 2.1433 2.0657 2.0681 3.0892 3.8199 3.7941 3.8925 3.8815 3.7469 3.9144 3.9046 4.1184 3.9432 3.9605 3.7752 3.6512 3.9915 3.9767 3.9670 3.8926 3.9128 3.8993 3.6993 3.9078 4.0074 3.8933 3.8880 3.8989 1.0221 1.0285 0.9951 1.0003 1.0093 1.0016 1.0014 1.0055 1.0021 1.0109 1.0073 1.0086 1.0030 1.0015 1.0108 1.0256 1.0270 1.0013 0.9910 0.9945 0.9947 1.0072 0.9904 0.9892 0.9900
dispcorr: -0.031115938 hartree
energy: -1285.356873749194
dipole: -8.03740 9.70248 1.66509 13.48233 -12.56653 0.91580 4.34325 -1.74481 2.59844
magnitude: 3.21918 au
magnitude: 8.18250 debye
