program: Orca
programVersion: 5.0.2
elementType: O O O O N C C C C C C C C C C C C C C C C C C C C C C C C H H H H H H H H H H H H H H H H H H H H H H H H H
charge: 0
multiplicity: 1
keywords: wb97x-d3
keywords: def2-TZVPP
keywords: def2/J RIJCOSX
keywords: DEFGRID2
keywords: scfconv7
keywords: smallprint printgap noloewdin
keywords: NOSOSCF
formula: C24H25NO4
InChI: InChI=1/C24H25NO4/c1-23(2)19(21-24(3,4)29-21)20(23)22(26)28-18(14-25)15-9-8-12-17(13-15)27-16-10-6-5-7-11-16/h5-13,18-21H,1-4H3
54 atoms
O  -4.283328 0.695743 -2.71497
O  -1.680652 -0.696843 0.388563
O  -3.019419 -1.800141 1.782249
O  3.886519 -0.391032 1.314717
N  -1.389928 -3.872274 -0.745309
C  -4.051242 1.029338 -0.286726
C  -3.345838 1.779084 0.790119
C  -3.720911 0.32305 1.023181
C  -3.41641 0.647224 -1.586629
C  -3.771823 -0.575164 -2.315233
C  -1.915556 2.238952 0.634454
C  -4.174385 2.759977 1.588526
C  -2.801969 -0.820347 1.112989
C  -2.781907 -1.177528 -3.27472
C  -4.778121 -1.545278 -1.757045
C  -0.691034 -1.704148 0.544004
C  0.606956 -1.15868 0.007539
C  -1.098067 -2.919059 -0.173925
C  1.673531 -1.001855 0.877841
C  0.722456 -0.775772 -1.324672
C  2.869034 -0.465768 0.413809
C  1.918171 -0.239292 -1.771861
C  2.998304 -0.080796 -0.913692
C  4.830449 0.598624 1.210318
C  6.163904 0.222008 1.246044
C  4.468337 1.938063 1.142392
C  7.147847 1.200974 1.225542
C  5.462093 2.905118 1.112134
C  6.802343 2.542936 1.155375
H  -5.112192 1.237766 -0.383726
H  -4.571834 0.169667 1.676307
H  -2.42893 1.064998 -1.777226
H  -1.404943 2.237417 1.598971
H  -1.315422 1.65316 -0.055281
H  -1.913553 3.266866 0.266697
H  -4.207458 3.728647 1.08605
H  -3.746395 2.91472 2.580913
H  -5.202429 2.419408 1.718397
H  -3.293937 -1.581154 -4.151087
H  -2.242647 -2.000848 -2.805653
H  -2.051588 -0.444544 -3.619267
H  -4.272851 -2.333991 -1.19709
H  -5.332044 -2.026805 -2.5656
H  -5.500482 -1.072169 -1.093074
H  -0.571454 -1.976192 1.596685
H  1.58502 -1.292736 1.917908
H  -0.106188 -0.89763 -2.011018
H  2.019712 0.056769 -2.80759
H  3.927092 0.330524 -1.287876
H  6.428632 -0.826583 1.299146
H  3.424874 2.22805 1.123205
H  8.189287 0.908297 1.259371
H  5.18352 3.949865 1.063315
H  7.572081 3.303308 1.13786
elementType: O N C H
totalener: -1285.32606460 hartree
nucrepener: 2697.75832976 hartree
electener: -3983.08439437 hartree
oneelecener: -7108.68494475 hartree
twoeener: 3125.60055038 hartree
cpcmener: -0.03700813 hartree
kineticenergy: 1279.67843566 hartree
xcener: -124.705041160482 hartree
chargesum: 0.0000000
charge: -0.456230 -0.259501 -0.443479 -0.325794 -0.087148 -0.116620 0.112996 -0.124751 0.125260 0.231391 -0.271760 -0.261938 0.395872 -0.298690 -0.273256 0.360279 0.001600 -0.224993 -0.182224 -0.218305 0.231725 -0.165406 -0.151987 0.246985 -0.226058 -0.171959 -0.130195 -0.148755 -0.171754 0.104844 0.093631 0.116652 0.105485 0.075022 0.100178 0.096050 0.097033 0.088945 0.113726 0.085172 0.094340 0.088719 0.107907 0.100479 0.127427 0.135856 0.176219 0.158018 0.156847 0.146897 0.159331 0.158049 0.159357 0.158512
qa: -0.4562 -0.2595 -0.4435 -0.3258 -0.0871 -0.1166 0.1130 -0.1248 0.1253 0.2314 -0.2718 -0.2619 0.3959 -0.2987 -0.2733 0.3603 0.0016 -0.2250 -0.1822 -0.2183 0.2317 -0.1654 -0.1520 0.2470 -0.2261 -0.1720 -0.1302 -0.1488 -0.1718 0.1048 0.0936 0.1167 0.1055 0.0750 0.1002 0.0960 0.0970 0.0889 0.1137 0.0852 0.0943 0.0887 0.1079 0.1005 0.1274 0.1359 0.1762 0.1580 0.1568 0.1469 0.1593 0.1580 0.1594 0.1585
va: 1.9436 2.1471 2.0615 2.0730 3.0847 3.8303 3.7758 3.8983 3.8881 3.7319 3.9136 3.9027 4.1187 3.9592 3.9579 3.7943 3.6871 3.9975 4.0216 3.9280 3.7979 3.9768 3.8890 3.7134 4.0043 3.9204 3.8890 3.8943 3.8947 1.0214 1.0288 0.9991 1.0006 1.0098 1.0016 1.0019 1.0014 1.0054 1.0077 1.0082 1.0030 1.0104 1.0027 1.0021 1.0267 1.0148 0.9734 0.9934 0.9964 1.0067 0.9956 0.9894 0.9904 0.9902
dispcorr: -0.030319286 hartree
energy: -1285.356383888942
dipole: -13.70775 15.42167 1.71391 14.36230 -11.83354 2.52876 -5.36187 5.84966 0.48780
magnitude: 3.09355 au
magnitude: 7.86319 debye
