program: Orca
programVersion: 5.0.2
elementType: O O O O N C C C C C C C C C C C C C C C C C C C C C C C C H H H H H H H H H H H H H H H H H H H H H H H H H
charge: 0
multiplicity: 1
keywords: wb97x-d3
keywords: def2-TZVPP
keywords: def2/J RIJCOSX
keywords: DEFGRID2
keywords: scfconv7
keywords: smallprint printgap noloewdin
keywords: NOSOSCF
formula: C24H25NO4
InChI: InChI=1/C24H25NO4/c1-23(2)19(21-24(3,4)29-21)20(23)22(26)28-18(14-25)15-9-8-12-17(13-15)27-16-10-6-5-7-11-16/h5-13,18-21H,1-4H3
54 atoms
O  -4.148678 0.824283 -2.751951
O  -1.694345 -0.718367 0.346696
O  -3.034219 -1.637514 1.87025
O  3.8026 -0.441069 1.376427
N  -1.590902 -3.926975 -0.694082
C  -3.899178 1.17941 -0.328251
C  -3.148945 1.894042 0.741795
C  -3.633007 0.472597 0.994724
C  -3.289038 0.732384 -1.61987
C  -3.729552 -0.472523 -2.329336
C  -1.685105 2.23661 0.59679
C  -3.907366 2.947176 1.517422
C  -2.785987 -0.720821 1.126332
C  -2.784292 -1.158465 -3.277187
C  -4.803713 -1.358864 -1.757381
C  -0.757014 -1.771519 0.532285
C  0.571598 -1.301949 0.000485
C  -1.231941 -2.976227 -0.158764
C  1.601138 -1.073716 0.900511
C  0.748523 -1.038554 -1.353204
C  2.820028 -0.58766 0.444625
C  1.968321 -0.551288 -1.793343
C  3.010488 -0.323072 -0.905178
C  4.726599 0.564366 1.252783
C  4.344218 1.879658 1.019279
C  6.060418 0.233217 1.436384
C  5.317677 2.866379 0.965809
C  7.02268 1.232582 1.390488
C  6.6574 2.549706 1.150785
H  -4.940894 1.46547 -0.435795
H  -4.495242 0.393255 1.646251
H  -2.274015 1.076742 -1.812947
H  -1.596103 3.255996 0.216241
H  -1.186115 2.20717 1.567069
H  -1.127036 1.595416 -0.07895
H  -3.855398 3.909569 1.004578
H  -3.482972 3.078971 2.514697
H  -4.960989 2.690801 1.634857
H  -2.007485 -0.482659 -3.637153
H  -3.324484 -1.543354 -4.145085
H  -2.300025 -2.007332 -2.793799
H  -4.357695 -2.169415 -1.178433
H  -5.386564 -1.817091 -2.559243
H  -5.494025 -0.822229 -1.107718
H  -0.659456 -2.025973 1.591364
H  1.464163 -1.271264 1.957147
H  -0.051795 -1.213558 -2.061586
H  2.118184 -0.349102 -2.845674
H  3.9592 0.047567 -1.272105
H  3.300381 2.137815 0.888613
H  6.341259 -0.796341 1.620025
H  5.022292 3.892118 0.786226
H  8.063686 0.974679 1.536494
H  7.410464 3.325817 1.111598
elementType: O N C H
totalener: -1285.32626121 hartree
nucrepener: 2705.22187952 hartree
electener: -3990.54814073 hartree
oneelecener: -7123.53443221 hartree
twoeener: 3132.98629148 hartree
cpcmener: -0.03691648 hartree
kineticenergy: 1279.67270372 hartree
xcener: -124.703728149871 hartree
chargesum: 0.0000000
charge: -0.456642 -0.258078 -0.445675 -0.326339 -0.084336 -0.117115 0.109562 -0.123779 0.131481 0.229895 -0.273338 -0.262012 0.398448 -0.295320 -0.274704 0.363095 0.007530 -0.229322 -0.193890 -0.219514 0.239403 -0.157975 -0.154625 0.254360 -0.176884 -0.231136 -0.148272 -0.127827 -0.175220 0.105550 0.093578 0.116238 0.100828 0.105780 0.075136 0.095374 0.097245 0.089037 0.094097 0.111960 0.083111 0.089720 0.107937 0.100247 0.126673 0.135191 0.172228 0.158531 0.156913 0.160373 0.146323 0.159589 0.157991 0.158578
qa: -0.4566 -0.2581 -0.4457 -0.3263 -0.0843 -0.1171 0.1096 -0.1238 0.1315 0.2299 -0.2733 -0.2620 0.3984 -0.2953 -0.2747 0.3631 0.0075 -0.2293 -0.1939 -0.2195 0.2394 -0.1580 -0.1546 0.2544 -0.1769 -0.2311 -0.1483 -0.1278 -0.1752 0.1055 0.0936 0.1162 0.1008 0.1058 0.0751 0.0954 0.0972 0.0890 0.0941 0.1120 0.0831 0.0897 0.1079 0.1002 0.1267 0.1352 0.1722 0.1585 0.1569 0.1604 0.1463 0.1596 0.1580 0.1586
va: 1.9444 2.1415 2.0617 2.0731 3.0859 3.8267 3.7780 3.8968 3.8894 3.7314 3.9144 3.9028 4.1162 3.9564 3.9600 3.7879 3.6742 4.0079 4.0284 3.9379 3.7881 3.9713 3.8988 3.7095 3.9127 4.0047 3.8939 3.8878 3.8987 1.0213 1.0284 0.9996 1.0016 1.0000 1.0107 1.0022 1.0013 1.0053 1.0034 1.0081 1.0087 1.0096 1.0028 1.0020 1.0281 1.0152 0.9809 0.9929 0.9959 0.9954 1.0071 0.9903 0.9892 0.9901
dispcorr: -0.030405687 hartree
energy: -1285.356666897477
dipole: -12.63094 14.43658 1.80565 14.86435 -12.45482 2.40953 -5.74848 6.10931 0.36083
magnitude: 3.03256 au
magnitude: 7.70815 debye
