program: Orca
programVersion: 5.0.2
elementType: O O O O N C C C C C C C C C C C C C C C C C C C C C C C C H H H H H H H H H H H H H H H H H H H H H H H H H
charge: 0
multiplicity: 1
keywords: wb97x-d3
keywords: def2-TZVPP
keywords: def2/J RIJCOSX
keywords: DEFGRID2
keywords: scfconv7
keywords: smallprint printgap noloewdin
keywords: NOSOSCF
formula: C24H25NO4
InChI: InChI=1/C24H25NO4/c1-23(2)19(21-24(3,4)29-21)20(23)22(26)28-18(14-25)15-9-8-12-17(13-15)27-16-10-6-5-7-11-16/h5-13,18-21H,1-4H3
54 atoms
O  -4.358792 0.55678 -2.740863
O  -1.718585 -0.606859 0.40623
O  -2.959711 -1.778545 1.83418
O  4.015451 -0.498356 1.134549
N  -1.221615 -3.743425 -0.727261
C  -4.198807 0.915056 -0.314654
C  -3.589502 1.732167 0.771715
C  -3.841438 0.250241 1.009546
C  -3.507464 0.583215 -1.599902
C  -3.74855 -0.665972 -2.330104
C  -2.201145 2.313942 0.652803
C  -4.522195 2.641943 1.538654
C  -2.82638 -0.804061 1.136491
C  -2.702551 -1.18778 -3.277627
C  -4.674937 -1.7168 -1.779894
C  -0.661232 -1.538746 0.567541
C  0.604778 -0.92875 0.019752
C  -0.988593 -2.777187 -0.150975
C  1.742022 -0.93574 0.81221
C  0.638243 -0.371143 -1.253804
C  2.925293 -0.393584 0.325697
C  1.822252 0.175929 -1.720576
C  2.972523 0.166816 -0.943416
C  4.984189 0.470336 1.135912
C  6.304021 0.044851 1.147305
C  4.671276 1.822637 1.196452
C  7.321898 0.984369 1.226573
C  5.699874 2.750933 1.262995
C  7.025714 2.338976 1.279161
H  -5.271236 1.030456 -0.437133
H  -4.690851 0.028881 1.644796
H  -2.556776 1.08478 -1.77627
H  -1.527896 1.771157 -0.003679
H  -2.276438 3.331021 0.263544
H  -1.726382 2.376211 1.63334
H  -5.520709 2.215097 1.639982
H  -4.622404 3.601901 1.028363
H  -4.139212 2.836835 2.542162
H  -2.096376 -1.956487 -2.798349
H  -2.036949 -0.39727 -3.625584
H  -3.171978 -1.642568 -4.152607
H  -5.447872 -1.306327 -1.131664
H  -4.109969 -2.452589 -1.205397
H  -5.170006 -2.252208 -2.592608
H  -0.521212 -1.795818 1.621339
H  1.719378 -1.364122 1.80721
H  -0.243053 -0.364472 -1.882187
H  1.858577 0.608373 -2.711696
H  3.890939 0.585254 -1.334728
H  6.53055 -1.012942 1.103124
H  3.640383 2.154324 1.200839
H  8.351496 0.651266 1.241106
H  5.458598 3.804811 1.311943
H  7.822032 3.069067 1.336598
elementType: O N C H
totalener: -1285.32590826 hartree
nucrepener: 2690.93392750 hartree
electener: -3976.25983576 hartree
oneelecener: -7094.99276203 hartree
twoeener: 3118.73292626 hartree
cpcmener: -0.03697862 hartree
kineticenergy: 1279.68409049 hartree
xcener: -124.707173108817 hartree
chargesum: 0.0000000
charge: -0.457381 -0.263745 -0.442281 -0.325396 -0.089151 -0.112152 0.109468 -0.124242 0.124144 0.222259 -0.269491 -0.262638 0.396603 -0.293381 -0.272745 0.360838 0.025708 -0.224044 -0.192020 -0.219229 0.239599 -0.159134 -0.161073 0.270488 -0.241148 -0.185176 -0.123554 -0.144743 -0.179785 0.104506 0.093417 0.117113 0.073879 0.100269 0.105460 0.089173 0.096265 0.097082 0.089096 0.095832 0.112849 0.099978 0.088551 0.107905 0.128982 0.136131 0.162367 0.157554 0.157385 0.146422 0.157847 0.157754 0.159309 0.158274
qa: -0.4574 -0.2637 -0.4423 -0.3254 -0.0892 -0.1122 0.1095 -0.1242 0.1241 0.2223 -0.2695 -0.2626 0.3966 -0.2934 -0.2727 0.3608 0.0257 -0.2240 -0.1920 -0.2192 0.2396 -0.1591 -0.1611 0.2705 -0.2411 -0.1852 -0.1236 -0.1447 -0.1798 0.1045 0.0934 0.1171 0.0739 0.1003 0.1055 0.0892 0.0963 0.0971 0.0891 0.0958 0.1128 0.1000 0.0886 0.1079 0.1290 0.1361 0.1624 0.1576 0.1574 0.1464 0.1578 0.1578 0.1593 0.1583
va: 1.9407 2.1473 2.0642 2.0769 3.0843 3.8266 3.7837 3.8987 3.8848 3.7463 3.9131 3.9030 4.1220 3.9522 3.9592 3.7893 3.6694 3.9929 4.0384 3.9320 3.7944 3.9672 3.9001 3.6955 4.0090 3.9165 3.8874 3.8920 3.9008 1.0224 1.0287 0.9980 1.0096 1.0015 1.0006 1.0054 1.0019 1.0014 1.0107 1.0033 1.0079 1.0024 1.0103 1.0027 1.0288 1.0148 0.9822 0.9930 0.9953 1.0078 0.9964 0.9894 0.9904 0.9904
dispcorr: -0.030330452 hartree
energy: -1285.356238710043
dipole: -14.81721 16.30992 1.49271 13.91211 -11.30497 2.60714 -5.13747 5.65907 0.52160
magnitude: 3.04917 au
magnitude: 7.75036 debye
