program: Orca
programVersion: 5.0.2
elementType: O O O O N C C C C C C C C C C C C C C C C C C C C C C C C H H H H H H H H H H H H H H H H H H H H H H H H H
charge: 0
multiplicity: 1
keywords: wb97x-d3
keywords: def2-TZVPP
keywords: def2/J RIJCOSX
keywords: DEFGRID2
keywords: scfconv7
keywords: smallprint printgap noloewdin
keywords: NOSOSCF
formula: C24H25NO4
InChI: InChI=1/C24H25NO4/c1-23(2)19(21-24(3,4)29-21)20(23)22(26)28-18(14-25)15-9-8-12-17(13-15)27-16-10-6-5-7-11-16/h5-13,18-21H,1-4H3
54 atoms
O  -3.638603 1.148322 -2.741076
O  -1.643831 -0.839507 0.366265
O  -3.079418 -1.597107 1.893016
O  3.663605 -0.462336 1.382383
N  -1.946454 -4.019902 -0.683488
C  -3.51594 1.352866 -0.290813
C  -2.761424 1.9252 0.859096
C  -3.429758 0.564151 1.008316
C  -2.876701 0.89359 -1.564039
C  -3.412024 -0.210663 -2.36422
C  -1.259892 2.084458 0.82571
C  -3.437013 3.030181 1.637802
C  -2.725527 -0.716923 1.147573
C  -2.496741 -0.969041 -3.286206
C  -4.62033 -0.983069 -1.908721
C  -0.830758 -1.9935 0.539252
C  0.534359 -1.65561 0.001844
C  -1.453035 -3.130698 -0.149368
C  1.493813 -1.217912 0.905509
C  0.813078 -1.680126 -1.358023
C  2.738281 -0.817036 0.445653
C  2.06201 -1.273563 -1.804541
C  3.031195 -0.841851 -0.912188
C  4.427573 0.658837 1.20564
C  3.91992 1.823552 0.642781
C  5.732895 0.608199 1.674359
C  4.737975 2.940683 0.547498
C  6.534915 1.736402 1.58149
C  6.044794 2.904973 1.014709
H  -4.505934 1.769546 -0.448313
H  -4.335644 0.564363 1.602911
H  -1.816509 1.115663 -1.675415
H  -0.841201 1.97633 1.828002
H  -0.737908 1.38845 0.175747
H  -1.017396 3.090622 0.478186
H  -3.225494 4.000374 1.183913
H  -3.075936 3.058927 2.667728
H  -4.520436 2.907652 1.667913
H  -2.182319 -1.90723 -2.828032
H  -1.603176 -0.396486 -3.537758
H  -3.011518 -1.219187 -4.216584
H  -5.290167 -0.3957 -1.282182
H  -4.31179 -1.862933 -1.341319
H  -5.19238 -1.338063 -2.768679
H  -0.75393 -2.262145 1.59686
H  1.278325 -1.189279 1.967109
H  0.072061 -2.016395 -2.072041
H  2.28803 -1.298746 -2.862215
H  4.006147 -0.540345 -1.274351
H  2.897797 1.872341 0.288061
H  6.113776 -0.305384 2.113718
H  4.341986 3.848559 0.110768
H  7.551679 1.696202 1.950585
H  6.675259 3.7812 0.940418
elementType: O N C H
totalener: -1285.32609938 hartree
nucrepener: 2733.41229066 hartree
electener: -4018.73839004 hartree
oneelecener: -7179.75405542 hartree
twoeener: 3161.01566538 hartree
cpcmener: -0.03712115 hartree
kineticenergy: 1279.68603690 hartree
xcener: -124.706267880909 hartree
chargesum: 0.0000000
charge: -0.458400 -0.251557 -0.445954 -0.326660 -0.081948 -0.116210 0.107824 -0.121116 0.137748 0.224545 -0.279736 -0.262163 0.399903 -0.285054 -0.276080 0.362611 0.030077 -0.230533 -0.236309 -0.208763 0.246340 -0.145817 -0.157070 0.269581 -0.179319 -0.243670 -0.153230 -0.123214 -0.182065 0.105962 0.093448 0.115471 0.106350 0.074289 0.102440 0.095820 0.097198 0.088575 0.078076 0.096038 0.110266 0.099552 0.089975 0.107833 0.131979 0.133862 0.159865 0.160088 0.159324 0.160477 0.145517 0.158211 0.157569 0.158057
qa: -0.4584 -0.2516 -0.4460 -0.3267 -0.0819 -0.1162 0.1078 -0.1211 0.1377 0.2245 -0.2797 -0.2622 0.3999 -0.2851 -0.2761 0.3626 0.0301 -0.2305 -0.2363 -0.2088 0.2463 -0.1458 -0.1571 0.2696 -0.1793 -0.2437 -0.1532 -0.1232 -0.1821 0.1060 0.0934 0.1155 0.1064 0.0743 0.1024 0.0958 0.0972 0.0886 0.0781 0.0960 0.1103 0.0996 0.0900 0.1078 0.1320 0.1339 0.1599 0.1601 0.1593 0.1605 0.1455 0.1582 0.1576 0.1581
va: 1.9440 2.1273 2.0622 2.0705 3.0870 3.8201 3.7882 3.8995 3.8968 3.7408 3.9095 3.9023 4.1127 3.9511 3.9629 3.7789 3.6576 4.0115 4.0506 3.9559 3.7563 3.9592 3.9328 3.7042 3.8893 4.0035 3.9030 3.8905 3.9011 1.0214 1.0281 0.9997 0.9993 1.0116 1.0011 1.0022 1.0014 1.0056 1.0120 1.0025 1.0089 1.0022 1.0089 1.0029 1.0217 1.0162 0.9926 0.9921 0.9942 0.9946 1.0083 0.9912 0.9891 0.9903
dispcorr: -0.030915159 hartree
energy: -1285.357014542509
dipole: -10.42871 12.30770 1.87899 15.72441 -13.64563 2.07879 -5.60203 5.89607 0.29404
magnitude: 2.81752 au
magnitude: 7.16156 debye
