program: Orca
programVersion: 5.0.2
elementType: O O O O N C C C C C C C C C C C C C C C C C C C C C C C C H H H H H H H H H H H H H H H H H H H H H H H H H
charge: 0
multiplicity: 1
keywords: wb97x-d3
keywords: def2-TZVPP
keywords: def2/J RIJCOSX
keywords: DEFGRID2
keywords: scfconv7
keywords: smallprint printgap noloewdin
keywords: NOSOSCF
formula: C24H25NO4
InChI: InChI=1/C24H25NO4/c1-23(2)19(21-24(3,4)29-21)20(23)22(26)28-18(14-25)15-9-8-12-17(13-15)27-16-10-6-5-7-11-16/h5-13,18-21H,1-4H3
54 atoms
O  -3.979228 0.524237 -2.42496
O  -1.200346 -0.590713 0.433165
O  -2.095406 -0.885723 2.451792
O  3.833693 0.456358 -0.869289
N  -1.585807 -3.936716 0.526425
C  -3.262815 1.386449 -0.226631
C  -2.269935 2.226575 0.499395
C  -2.810163 0.96633 1.165123
C  -2.943448 0.583598 -1.449317
C  -3.616031 -0.68166 -1.751815
C  -0.833398 2.338346 0.045519
C  -2.781867 3.511323 1.109217
C  -2.022056 -0.243699 1.433293
C  -2.924557 -1.702362 -2.613398
C  -4.647711 -1.249923 -0.814676
C  -0.295717 -1.665269 0.655993
C  0.790571 -1.536433 -0.381498
C  -1.019328 -2.938977 0.581449
C  1.816641 -0.637537 -0.102905
C  0.7480 -2.208758 -1.592382
C  2.807821 -0.417479 -1.048172
C  1.747952 -1.977108 -2.52965
C  2.775037 -1.089655 -2.267155
C  4.081263 0.961589 0.385228
C  4.621468 0.147369 1.37085
C  3.823688 2.301584 0.624578
C  4.904552 0.69068 2.61519
C  4.119961 2.835821 1.872024
C  4.654892 2.033301 2.869761
H  -4.279098 1.768201 -0.229684
H  -3.529174 1.138836 1.957164
H  -1.953449 0.733122 -1.876622
H  -0.474019 1.50459 -0.549742
H  -0.722634 3.236823 -0.564598
H  -0.165077 2.443881 0.902124
H  -2.166838 3.813752 1.958911
H  -3.810615 3.41793 1.45941
H  -2.754349 4.318383 0.374391
H  -2.133636 -1.258508 -3.218783
H  -3.637277 -2.184408 -3.286443
H  -2.481522 -2.484634 -1.996243
H  -4.177495 -1.934867 -0.106614
H  -5.394016 -1.821515 -1.370621
H  -5.172255 -0.484403 -0.24451
H  0.140791 -1.601107 1.657446
H  1.824203 -0.116121 0.846521
H  -0.045982 -2.908785 -1.817961
H  1.725999 -2.498708 -3.477298
H  3.553192 -0.913549 -2.999254
H  4.822624 -0.897307 1.167411
H  3.403308 2.921481 -0.157576
H  5.326522 0.060766 3.387539
H  3.925037 3.883188 2.062744
H  4.880954 2.452208 3.841602
elementType: O N C H
totalener: -1285.32607168 hartree
nucrepener: 2785.43340924 hartree
electener: -4070.75948093 hartree
oneelecener: -7283.96380291 hartree
twoeener: 3213.20432199 hartree
cpcmener: -0.03672499 hartree
kineticenergy: 1279.68454710 hartree
xcener: -124.707040010380 hartree
chargesum: 0.0000000
charge: -0.458002 -0.247797 -0.443224 -0.324234 -0.078388 -0.117006 0.106553 -0.111829 0.143527 0.216571 -0.279813 -0.265356 0.390781 -0.273133 -0.278738 0.362497 0.016988 -0.231737 -0.251265 -0.227673 0.318630 -0.118156 -0.231362 0.256239 -0.177538 -0.214845 -0.149614 -0.141888 -0.158497 0.105896 0.092811 0.118941 0.074575 0.101802 0.106163 0.097601 0.089108 0.096173 0.095397 0.109998 0.072834 0.090305 0.107534 0.099429 0.138367 0.136168 0.147949 0.158330 0.146694 0.154974 0.148448 0.160178 0.158576 0.160061
qa: -0.4580 -0.2478 -0.4432 -0.3242 -0.0784 -0.1170 0.1066 -0.1118 0.1435 0.2166 -0.2798 -0.2654 0.3908 -0.2731 -0.2787 0.3625 0.0170 -0.2317 -0.2513 -0.2277 0.3186 -0.1182 -0.2314 0.2562 -0.1775 -0.2148 -0.1496 -0.1419 -0.1585 0.1059 0.0928 0.1189 0.0746 0.1018 0.1062 0.0976 0.0891 0.0962 0.0954 0.1100 0.0728 0.0903 0.1075 0.0994 0.1384 0.1362 0.1479 0.1583 0.1467 0.1550 0.1484 0.1602 0.1586 0.1601
va: 1.9469 2.1129 2.0650 2.0921 3.0923 3.8258 3.7843 3.8925 3.8981 3.7558 3.9107 3.9045 4.1141 3.9520 3.9657 3.7889 3.7083 3.9978 3.9230 3.9541 3.6912 3.9604 4.0155 3.6975 3.9473 3.9866 3.8914 3.8885 3.8889 1.0204 1.0275 0.9988 1.0110 1.0020 0.9988 1.0010 1.0054 1.0018 1.0035 1.0085 1.0122 1.0082 1.0027 1.0021 1.0145 1.0128 1.0000 0.9901 1.0069 0.9983 1.0044 0.9899 0.9896 0.9896
dispcorr: -0.031875158 hartree
energy: -1285.357946838969
dipole: -12.47177 14.23691 1.76514 12.18658 -10.29995 1.88663 -2.37905 2.59864 0.21959
magnitude: 2.59293 au
magnitude: 6.59071 debye
