program: Orca
programVersion: 5.0.2
elementType: O O O O N C C C C C C C C C C C C C C C C C C C C C C C C H H H H H H H H H H H H H H H H H H H H H H H H H
charge: 0
multiplicity: 1
keywords: wb97x-d3
keywords: def2-TZVPP
keywords: def2/J RIJCOSX
keywords: DEFGRID2
keywords: scfconv7
keywords: smallprint printgap noloewdin
keywords: NOSOSCF
formula: C24H25NO4
InChI: InChI=1/C24H25NO4/c1-23(2)19(21-24(3,4)29-21)20(23)22(26)28-18(14-25)15-9-8-12-17(13-15)27-16-10-6-5-7-11-16/h5-13,18-21H,1-4H3
54 atoms
O  -2.955128 3.375378 -0.911654
O  -1.230152 -1.634753 0.005607
O  -2.538905 -0.238828 1.155259
O  3.335014 0.926092 0.332137
N  0.739635 -4.179598 0.746232
C  -3.291745 0.997347 -1.499493
C  -4.237893 -0.149792 -1.46164
C  -2.754247 -0.402828 -1.228036
C  -3.253375 2.062114 -0.448794
C  -2.01582 2.734232 -0.047475
C  -5.246101 -0.308152 -0.351125
C  -4.753565 -0.650753 -2.790423
C  -2.208516 -0.714507 0.098296
C  -1.916469 3.314511 1.337297
C  -0.696134 2.373274 -0.673441
C  -0.548946 -1.956238 1.213538
C  0.419374 -0.873593 1.627324
C  0.164743 -3.203443 0.932374
C  1.445685 -0.510987 0.762122
C  0.257395 -0.228998 2.844118
C  2.326246 0.492726 1.138673
C  1.136246 0.784627 3.199533
C  2.172092 1.146982 2.355333
C  3.988835 0.053599 -0.497847
C  4.279691 0.497733 -1.779216
C  4.407517 -1.19967 -0.06716
C  5.001059 -0.320779 -2.636796
C  5.117169 -2.011495 -0.939565
C  5.417694 -1.578483 -2.224277
H  -3.033826 1.360799 -2.489197
H  -2.226369 -0.875242 -2.047794
H  -4.057663 2.034837 0.28428
H  -5.512699 -1.359829 -0.232089
H  -4.916091 0.056847 0.61739
H  -6.158713 0.232252 -0.610059
H  -5.028892 -1.705472 -2.731172
H  -4.013434 -0.543495 -3.584384
H  -5.642427 -0.091035 -3.08838
H  -1.432414 2.603896 2.009019
H  -2.897026 3.551482 1.75145
H  -1.317635 4.227592 1.338328
H  -0.171013 1.643311 -0.055628
H  -0.055338 3.254843 -0.74477
H  -0.79949 1.954952 -1.673925
H  -1.255696 -2.160727 2.023592
H  1.554071 -1.006395 -0.196143
H  -0.547037 -0.51334 3.509989
H  1.015907 1.296192 4.145324
H  2.861748 1.933835 2.633981
H  3.949596 1.478511 -2.098546
H  4.192539 -1.543582 0.937129
H  5.230871 0.028256 -3.635293
H  5.443214 -2.987949 -0.605268
H  5.974916 -2.216537 -2.897461
elementType: O N C H
totalener: -1285.32876101 hartree
nucrepener: 2765.47969892 hartree
electener: -4050.80845993 hartree
oneelecener: -7245.00600575 hartree
twoeener: 3194.19754582 hartree
cpcmener: -0.03390854 hartree
kineticenergy: 1279.68537318 hartree
xcener: -124.708394004937 hartree
chargesum: -0.0000000
charge: -0.457142 -0.285058 -0.445357 -0.329166 -0.087754 -0.096126 0.090409 -0.082036 0.103321 0.222207 -0.290999 -0.258074 0.354684 -0.259030 -0.244816 0.440108 0.032150 -0.235704 -0.210114 -0.199944 0.250882 -0.126092 -0.221364 0.283126 -0.248804 -0.191908 -0.119931 -0.140543 -0.182578 0.106456 0.093533 0.117036 0.101658 0.093145 0.103749 0.096580 0.089146 0.097170 0.082473 0.093837 0.100481 0.038772 0.111391 0.102037 0.138955 0.145262 0.142674 0.158895 0.147659 0.145770 0.154484 0.157848 0.159095 0.157551
qa: -0.4571 -0.2851 -0.4454 -0.3292 -0.0878 -0.0961 0.0904 -0.0820 0.1033 0.2222 -0.2910 -0.2581 0.3547 -0.2590 -0.2448 0.4401 0.0321 -0.2357 -0.2101 -0.1999 0.2509 -0.1261 -0.2214 0.2831 -0.2488 -0.1919 -0.1199 -0.1405 -0.1826 0.1065 0.0935 0.1170 0.1017 0.0931 0.1037 0.0966 0.0891 0.0972 0.0825 0.0938 0.1005 0.0388 0.1114 0.1020 0.1390 0.1453 0.1427 0.1589 0.1477 0.1458 0.1545 0.1578 0.1591 0.1576
va: 1.9499 2.1319 2.0527 2.0722 3.1123 3.8297 3.8031 3.8613 3.9401 3.7747 3.9017 3.8936 4.1278 3.9444 3.9354 3.7295 3.5466 4.0790 3.8884 3.9256 3.7256 3.8911 3.9930 3.6925 4.0127 3.9119 3.8825 3.8901 3.9056 1.0204 1.0303 0.9973 1.0000 1.0186 0.9981 1.0024 1.0047 1.0017 1.0053 1.0091 1.0036 1.0320 1.0061 1.0059 1.0160 1.0152 1.0083 0.9893 1.0048 1.0082 0.9984 0.9892 0.9903 0.9907
dispcorr: -0.030839071 hartree
energy: -1285.359600078441
dipole: -17.70789 17.34426 -0.36363 10.29586 -10.16279 0.13307 -6.88296 6.91236 0.02939
magnitude: 0.38833 au
magnitude: 0.98705 debye
