program: Gaussian 09
title: 000072381
version: EM64L-G09RevD.01
frameworkgroup: C1[X(C18H25N3O2)]
method: RPBEPBE
basis: SDD
operation: Freq
keyword: #p
keyword: freq=noraman
keyword: PBEPBE/SDD
title: #p freq=noraman PBEPBE/SDD
converged: YES YES NO NO
title: Mulliken charges:
elementType: O O N N N C C C C C C C C C C C C C C C C C C H H H H H H H H H H H H H H H H H H H H H H H H H
charge: -0.278492 -0.320297 -0.419421 -0.367979 -0.054303 -0.478805 0.319272 0.372658 0.279708 0.390430 0.176536 -0.491301 -0.429754 -0.552891 -0.547789 -0.005898 -0.065000 -0.032124 -0.803888 -0.680662 -0.680988 -0.789750 -0.507672 0.255950 0.224412 0.338090 0.278819 0.242849 0.201332 0.213377 0.216367 0.213469 0.326122 0.234755 0.241010 0.248692 0.219072 0.227169 0.216215 0.215365 0.220103 0.230953 0.251284 0.226820 0.231658 0.225169 0.235148 0.234209
chargesum: 0.00000
title: Mulliken charges with hydrogens summed into heavy atoms:
elementType: O O N N N C C C C C C C C C C C C C C C C C C
charge: -0.278492 -0.320297 -0.081331 -0.041857 -0.054303 0.001557 0.319272 0.372658 0.279708 0.390430 0.176536 -0.212482 -0.186905 -0.138181 -0.117953 -0.005898 -0.065000 -0.032124 -0.079431 -0.018206 -0.014566 -0.079988 0.186854
polarizability: 3.31244699e+02 1.19534056e+01 2.52840060e+02 9.15417602e+00 3.16016177e+00 1.39772530e+02
1716.lowfreq: -8.8019 -0.0006 0.0005 0.0006 0.6663 4.5261 10.7386 22.4168 31.6953
frequency: 9.8931 22.3084 31.6816 47.4222 58.8932 68.2976 74.5471 78.6212 103.2995 118.1359 124.8359 130.8284 144.2288 157.6888 160.6657 168.5440 204.5917 207.9666 211.2333 229.0079 242.3692 274.4102 289.5773 310.3556 317.5433 343.8528 363.3864 376.9644 415.8407 429.3375 431.5858 461.6027 469.6838 498.4951 512.6812 549.8067 587.8661 592.0635 608.0776 648.8770 657.4987 667.7480 698.9770 704.6385 718.5655 720.5134 762.2832 764.9990 782.0011 783.6261 825.3401 849.1893 875.6831 932.0951 944.8207 962.7364 975.7807 986.8377 995.1011 1009.8328 1037.3497 1037.9493 1053.6330 1055.2401 1064.0018 1064.7303 1078.1840 1110.9501 1114.2667 1152.9825 1161.5982 1176.3578 1211.4418 1222.2740 1231.9503 1237.1143 1254.7400 1257.6691 1282.5104 1291.8246 1309.4963 1311.3644 1317.8573 1339.1271 1360.4706 1376.6954 1386.3415 1391.5500 1393.3625 1396.0127 1402.0326 1425.1330 1428.3769 1447.7360 1451.0652 1461.8073 1466.6213 1468.3808 1469.2131 1470.5255 1471.2145 1474.0204 1479.4911 1482.6929 1485.6749 1491.8148 1497.8862 1502.5409 1561.1085 1595.1606 1599.9254 1605.4561 1634.6110 2938.3187 2962.8758 2972.3018 2977.2416 2979.2831 2980.5911 2989.3023 2990.8532 2996.3667 3028.2982 3034.6948 3040.9782 3056.0566 3074.1244 3077.8783 3081.4686 3084.5702 3095.8494 3112.6842 3113.8435 3130.0570 3131.0757 3133.5370 3486.9575 3509.1452
redmass: 4.5123 3.7493 3.9535 1.9621 2.6969 2.0420 1.7997 3.4366 4.2238 1.7026 1.6710 2.2787 3.2705 1.6957 1.8401 3.3190 1.7452 2.3162 1.1320 2.6543 4.0638 3.1289 3.6917 2.0939 3.1996 2.3012 4.5165 3.5031 5.5657 3.2731 4.5050 4.5693 4.4925 4.4540 4.6225 4.2633 1.7341 4.0586 1.7756 4.6243 4.5520 4.3142 5.0835 5.5832 1.6176 4.1186 3.1025 4.8598 1.2696 1.2327 2.9238 1.4737 2.9005 1.3460 3.2522 2.0874 3.1072 1.9783 1.7197 1.7389 1.4614 1.5619 1.7666 1.4943 2.0963 1.8788 3.9437 3.0564 1.2916 1.5473 3.3923 3.1362 1.5682 1.6783 1.5487 1.3824 1.4447 1.4361 2.4126 3.7833 1.4704 1.5962 1.7269 3.7961 2.0091 1.8655 1.2243 2.0726 1.3359 1.8702 1.2447 1.8972 3.3393 1.0783 1.8826 1.1098 1.1122 1.0454 1.1011 1.0778 1.0487 1.0504 1.0543 1.0478 1.1004 1.0968 1.1162 1.8998 7.6874 6.6419 5.7174 4.3228 7.2349 1.0583 1.0406 1.1003 1.0350 1.0389 1.0351 1.0607 1.0607 1.0291 1.0981 1.1006 1.1005 1.0960 1.0999 1.1000 1.1009 1.1010 1.1040 1.0934 1.0980 1.0914 1.0905 1.1046 1.0761 1.0764
irintensity: 0.9226 0.1407 0.3886 0.0489 1.0028 1.7706 0.0275 1.6630 1.0548 1.2051 1.4135 7.2132 1.6419 7.3015 2.2282 1.5240 0.8901 0.9159 0.0205 2.4517 0.2420 0.4587 1.2644 0.5585 0.9367 0.0410 4.0771 13.5517 7.4886 7.2679 5.6362 3.2343 1.1972 6.9916 15.9612 2.0289 55.0821 15.7923 43.3694 7.2270 5.0669 3.3623 4.5836 1.5690 46.4402 4.9515 43.6852 4.7030 5.6857 1.3573 11.6376 28.9137 3.4332 10.6597 23.0296 7.8066 21.0129 5.1791 7.2366 24.4888 5.3771 5.7113 7.5022 0.8459 9.9462 5.8437 36.9526 18.2709 0.8559 33.2755 8.6159 24.6784 2.6513 2.1517 31.7153 3.3303 30.7380 3.6897 17.3777 70.2437 14.7183 7.4656 14.2290 18.4841 66.8719 4.7476 12.8460 85.9909 51.3461 16.5982 0.8121 38.7231 14.2189 21.1100 158.1731 22.3625 8.9123 10.3242 29.7151 10.0823 15.8234 7.6126 9.9354 7.0662 57.1756 12.8061 37.6821 150.6272 64.9602 500.4683 103.3848 59.4311 135.8011 23.9227 75.1576 19.8027 42.3543 20.5404 41.9754 37.9010 39.7497 60.3842 21.3111 11.3248 8.6734 18.7407 61.5785 54.1353 45.1845 45.4660 31.4137 13.4984 11.7987 5.6046 27.6409 24.6279 50.2544 33.8638
temp: 298.150 k
press: 1.00000 atm
elementType: 8 8 7 7 7 6 6 6 6 6 6 6 6 6 6 6 6 6 6 6 6 6 6 1 1 1 1 1 1 1 1 1 1 1 1 1 1 1 1 1 1 1 1 1 1 1 1 1
symmnumber: 1
zpe: 1051070.2 jmol-1
zpe.correction: 0.400332 hartree
zpe.thermalcorrener: 0.425345 hartree
zpe.thermalcorrenthalpy: 0.426290 hartree
zpe.thermalcorrgfe: 0.342897 hartree
zpe.sumelectzpe: -1013.914663 hartree
zpe.sumelectthermal: -1013.889649 hartree
zpe.sumelectthermalent: -1013.888705 hartree
zpe.sumelectthermalfe: -1013.972097 hartree
dipole: 1.2951 1.4115 1.3969
dipole: 2.3709
quadrupole: -105.3443 -134.0850 -141.6531
quadrupole: 0.3850 1.4087 -4.4844
quadrupole: 21.6832 -7.0575 -14.6256 0.3850 1.4087 -4.4844
hfenergy: -1014.3149943 hartree
pointgroup: C01 [X(C18H25N3O2)]
dipole: -0.5023275 -0.4864609 0.6173276 debye
polarizability: 330.6350563|7.1654107|250.7669384|-19.5248038|-12.2191407|142.4552948 unknown
InChI: InChI=1S/C18H25N3O2/c1-6-13-8-15(18(23-5)21-12(13)4)10-19-16-9-14(7-2)11(3)20-17(16)22/h8-9,19-20H,6-7,10H2,1-5H3
charge 0 multiplicity 1
48 atoms
O  2.139422 -2.901817 -0.246206
O  -1.707766 2.621827 -1.163187
N  -0.51967 0.344504 -0.239977
N  -3.785032 1.940393 -0.305216
N  4.015309 -1.473622 -0.03115
C  0.251287 -0.83983 0.12395
C  1.745515 -0.566402 0.146158
C  -4.123421 -0.141534 0.838735
C  -1.875837 0.487284 -0.019563
C  3.714134 0.907506 0.404084
C  -4.652915 1.055772 0.357134
C  2.307739 0.703185 0.380604
C  -2.72324 -0.417054 0.631197
C  -4.979968 -1.197574 1.525297
C  4.282215 2.302893 0.610689
C  4.545537 -0.226065 0.18571
C  2.676181 -1.627601 -0.044092
C  -2.419837 1.753252 -0.540361
C  -6.090364 1.516311 0.4468
C  -5.646489 -2.179207 0.524625
C  4.444649 3.083353 -0.722963
C  6.059662 -0.142524 0.190585
C  3.103793 -3.995442 -0.473476
H  0.051501 -1.692822 -0.558466
H  -0.068982 -1.179324 1.132876
H  -0.110444 1.068638 -0.840173
H  1.64069 1.555175 0.558398
H  -2.327138 -1.370209 0.999418
H  -5.763074 -0.727045 2.149381
H  -4.342781 -1.775612 2.221709
H  3.611589 2.877357 1.27818
H  5.262261 2.248403 1.119955
H  -4.157927 2.824669 -0.665477
H  -6.168724 2.510977 0.928784
H  -6.555796 1.595448 -0.555867
H  -6.697853 0.81332 1.035659
H  -6.324721 -1.642812 -0.164007
H  -4.883365 -2.689441 -0.090462
H  -6.234291 -2.950752 1.055934
H  5.117023 2.549756 -1.419354
H  4.866135 4.089068 -0.541813
H  3.469206 3.205448 -1.227116
H  6.476044 -1.118331 -0.103114
H  6.432548 0.62975 -0.506882
H  6.447417 0.112449 1.195778
H  2.475892 -4.888226 -0.612555
H  3.77418 -4.11089 0.395215
H  3.716504 -3.7963 -1.36938
