program: Orca
programVersion: 5.0.2
elementType: O O O O N C C C C C C C C C C C C C C C C C C C C C C C C H H H H H H H H H H H H H H H H H H H H H H H H H
charge: 0
multiplicity: 1
keywords: wb97x-d3
keywords: def2-TZVPP
keywords: def2/J RIJCOSX
keywords: DEFGRID2
keywords: scfconv7
keywords: smallprint printgap noloewdin
keywords: NOSOSCF
formula: C24H25NO4
InChI: InChI=1/C24H25NO4/c1-23(2)19(21-24(3,4)29-21)20(23)22(26)28-18(14-25)15-9-8-12-17(13-15)27-16-10-6-5-7-11-16/h5-13,18-21H,1-4H3
54 atoms
O  -1.079072 2.831118 -1.235025
O  -1.462331 -1.102862 0.298818
O  -3.5700 -1.811484 0.169407
O  3.594127 -0.610235 0.192722
N  -1.285491 -2.758458 -2.62615
C  -2.450917 1.692393 0.460111
C  -2.469372 1.276011 1.88968
C  -3.185024 0.41712 0.853528
C  -1.216307 1.695758 -0.384649
C  -1.249248 1.548166 -1.841588
C  -1.218239 0.816136 2.598467
C  -3.395418 2.039253 2.808168
C  -2.786186 -0.927803 0.41497
C  -0.030664 1.036721 -2.559943
C  -2.547109 1.318903 -2.567434
C  -0.992433 -2.393456 -0.051041
C  0.458977 -2.500199 0.346782
C  -1.163694 -2.592582 -1.495991
C  1.341367 -1.467757 0.047398
C  0.893926 -3.63376 1.016081
C  2.664285 -1.569476 0.452447
C  2.227833 -3.732229 1.390423
C  3.11293 -2.703758 1.12188
C  3.205527 0.692047 -0.001499
C  2.468249 1.373623 0.9589
C  3.623482 1.326402 -1.160988
C  2.138643 2.703152 0.739507
C  3.297669 2.661546 -1.361322
C  2.545894 3.350348 -0.420371
H  -3.13682 2.49311 0.201921
H  -4.265261 0.501846 0.864215
H  -0.291432 1.417174 0.116988
H  -0.490992 0.313545 1.968067
H  -0.719079 1.680951 3.040373
H  -1.471964 0.135341 3.413073
H  -2.89518 2.929467 3.194934
H  -3.693114 1.427718 3.662194
H  -4.303102 2.365035 2.298704
H  0.880265 1.20275 -1.983828
H  0.086119 1.538401 -3.523422
H  -0.118079 -0.032116 -2.757797
H  -2.723103 0.248124 -2.6883
H  -2.50985 1.756158 -3.567572
H  -3.405985 1.743382 -2.049131
H  -1.566115 -3.175493 0.454457
H  0.998198 -0.594406 -0.492168
H  0.200911 -4.431851 1.249564
H  2.576685 -4.612456 1.913918
H  4.149155 -2.772946 1.428086
H  2.154614 0.877976 1.869831
H  4.20096 0.781967 -1.897826
H  1.561104 3.23583 1.484023
H  3.623714 3.157855 -2.266322
H  2.284698 4.387526 -0.583877
elementType: O N C H
totalener: -1285.32632380 hartree
nucrepener: 2896.09664832 hartree
electener: -4181.42297213 hartree
oneelecener: -7505.43499979 hartree
twoeener: 3324.01202767 hartree
cpcmener: -0.03696643 hartree
kineticenergy: 1279.67822272 hartree
xcener: -124.710557838187 hartree
chargesum: -0.0000000
charge: -0.468283 -0.264359 -0.444271 -0.325237 -0.089583 -0.085516 0.105802 -0.141145 0.229089 0.181500 -0.265175 -0.261148 0.406986 -0.213553 -0.271940 0.363230 0.029202 -0.222876 -0.168601 -0.191791 0.265177 -0.111773 -0.241543 0.237272 -0.152054 -0.177608 -0.164378 -0.152484 -0.160818 0.102162 0.093556 0.035915 0.061215 0.102810 0.108224 0.095666 0.096950 0.089413 0.020476 0.114158 0.092593 0.089243 0.106546 0.097189 0.129726 0.089189 0.145226 0.158451 0.147281 0.164684 0.143548 0.158615 0.155408 0.157638
qa: -0.4683 -0.2644 -0.4443 -0.3252 -0.0896 -0.0855 0.1058 -0.1411 0.2291 0.1815 -0.2652 -0.2611 0.4070 -0.2136 -0.2719 0.3632 0.0292 -0.2229 -0.1686 -0.1918 0.2652 -0.1118 -0.2415 0.2373 -0.1521 -0.1776 -0.1644 -0.1525 -0.1608 0.1022 0.0936 0.0359 0.0612 0.1028 0.1082 0.0957 0.0969 0.0894 0.0205 0.1142 0.0926 0.0892 0.1065 0.0972 0.1297 0.0892 0.1452 0.1585 0.1473 0.1647 0.1435 0.1586 0.1554 0.1576
va: 1.9313 2.1471 2.0670 2.0979 3.0855 3.8216 3.8023 3.9364 3.8045 3.8076 3.9214 3.9018 4.1211 3.9458 3.9634 3.7966 3.6852 3.9988 3.9099 3.9421 3.7747 3.9093 3.9956 3.7154 3.8272 3.9259 3.8371 3.8643 3.8492 1.0211 1.0289 1.0021 0.9995 1.0005 1.0035 1.0016 1.0020 1.0054 1.0270 1.0094 1.0175 1.0070 1.0027 1.0028 1.0286 1.0267 1.0006 0.9892 1.0070 0.9887 1.0061 0.9930 0.9909 0.9908
dispcorr: -0.036238009 hartree
energy: -1285.362561811269
dipole: -8.13647 8.81746 0.68099 15.75780 -15.33150 0.42630 5.08640 -2.80578 2.28062
magnitude: 2.41800 au
magnitude: 6.14606 debye
