program: Orca
programVersion: 5.0.2
elementType: O O O O N C C C C C C C C C C C C C C C C C C C C C C C C H H H H H H H H H H H H H H H H H H H H H H H H H
charge: 0
multiplicity: 1
keywords: wb97x-d3
keywords: def2-TZVPP
keywords: def2/J RIJCOSX
keywords: DEFGRID2
keywords: scfconv7
keywords: smallprint printgap noloewdin
keywords: NOSOSCF
formula: C24H25NO4
InChI: InChI=1/C24H25NO4/c1-23(2)19(21-24(3,4)29-21)20(23)22(26)28-18(14-25)15-9-8-12-17(13-15)27-16-10-6-5-7-11-16/h5-13,18-21H,1-4H3
54 atoms
O  -3.098174 3.11963 -1.678407
O  -1.772294 -2.01443 -0.318079
O  -0.769083 -0.024485 -0.358995
O  3.653686 -1.003286 1.455947
N  0.373031 -1.849945 -2.936727
C  -3.455329 1.274597 -0.073912
C  -3.278111 0.820264 1.33234
C  -3.095614 -0.178239 0.19341
C  -2.506168 2.209522 -0.756094
C  -2.201343 2.12976 -2.184838
C  -2.102418 1.266553 2.165311
C  -4.532791 0.618232 2.148002
C  -1.766939 -0.674801 -0.176873
C  -0.881661 2.655519 -2.680768
C  -2.822112 1.069289 -3.053264
C  -0.530192 -2.640768 -0.613405
C  0.456601 -2.51985 0.526678
C  -0.01222 -2.168694 -1.903049
C  1.641925 -1.810976 0.410439
C  0.11561 -3.123786 1.732764
C  2.471279 -1.681666 1.517375
C  0.963005 -3.004116 2.822026
C  2.138523 -2.274468 2.725645
C  3.737959 0.166156 0.74811
C  2.707702 1.099283 0.723537
C  4.932458 0.413914 0.087069
C  2.880976 2.279804 0.015595
C  5.095899 1.605241 -0.604857
C  4.070716 2.539748 -0.651191
H  -4.484263 1.398204 -0.397065
H  -3.892586 -0.903192 0.077081
H  -1.753164 2.667657 -0.116736
H  -1.181908 1.412657 1.606039
H  -2.338955 2.213567 2.654299
H  -1.897014 0.535358 2.949109
H  -5.372232 0.292116 1.532694
H  -4.822576 1.551352 2.635439
H  -4.378943 -0.129802 2.928049
H  -0.473538 3.419627 -2.017831
H  -0.982871 3.089848 -3.677631
H  -0.152726 1.846466 -2.747244
H  -2.150509 0.21409 -3.144938
H  -2.992462 1.454739 -4.060845
H  -3.775785 0.709463 -2.66882
H  -0.789471 -3.693026 -0.754398
H  1.919027 -1.347614 -0.528516
H  -0.80658 -3.68406 1.824381
H  0.702456 -3.473742 3.761305
H  2.795218 -2.167101 3.579695
H  1.778393 0.918233 1.248822
H  5.72771 -0.320618 0.116755
H  2.07585 3.003328 -0.007022
H  6.029432 1.795912 -1.118485
H  4.198176 3.463675 -1.199647
elementType: O N C H
totalener: -1285.32661115 hartree
nucrepener: 2810.16662064 hartree
electener: -4095.49323178 hartree
oneelecener: -7335.22538166 hartree
twoeener: 3239.73214988 hartree
cpcmener: -0.03532184 hartree
kineticenergy: 1279.69048300 hartree
xcener: -124.710697230784 hartree
chargesum: -0.0000000
charge: -0.458733 -0.289583 -0.447955 -0.328852 -0.093830 -0.102752 0.093048 -0.098262 0.120649 0.219335 -0.278784 -0.259165 0.396296 -0.260158 -0.280301 0.512817 -0.029723 -0.255432 -0.173681 -0.259031 0.259118 -0.110180 -0.233346 0.291043 -0.189702 -0.248094 -0.158271 -0.121058 -0.182337 0.106818 0.093738 0.117730 0.077314 0.107930 0.100270 0.089390 0.096780 0.096197 0.089931 0.101258 0.084141 0.087003 0.107612 0.098137 0.145341 0.138606 0.143292 0.159462 0.147620 0.159479 0.145043 0.159272 0.157438 0.157122
qa: -0.4587 -0.2896 -0.4480 -0.3289 -0.0938 -0.1028 0.0930 -0.0983 0.1206 0.2193 -0.2788 -0.2592 0.3963 -0.2602 -0.2803 0.5128 -0.0297 -0.2554 -0.1737 -0.2590 0.2591 -0.1102 -0.2333 0.2910 -0.1897 -0.2481 -0.1583 -0.1211 -0.1823 0.1068 0.0937 0.1177 0.0773 0.1079 0.1003 0.0894 0.0968 0.0962 0.0899 0.1013 0.0841 0.0870 0.1076 0.0981 0.1453 0.1386 0.1433 0.1595 0.1476 0.1595 0.1450 0.1593 0.1574 0.1571
va: 1.9465 2.1325 2.0427 2.0874 3.0841 3.8431 3.8081 3.8795 3.9152 3.7734 3.9135 3.8953 4.0576 3.9451 3.9681 3.8158 3.6562 4.0667 3.8755 3.9906 3.7975 3.8881 4.0204 3.7012 3.8858 4.0059 3.8921 3.8890 3.9112 1.0198 1.0303 0.9968 1.0150 0.9989 1.0017 1.0047 1.0018 1.0024 1.0080 1.0045 1.0095 1.0064 1.0043 1.0020 0.9905 1.0158 1.0085 0.9888 1.0052 0.9901 1.0085 0.9909 0.9889 0.9908
dispcorr: -0.031025128 hartree
energy: -1285.357636274620
dipole: -16.27532 15.18198 -1.09334 13.94351 -15.32838 -1.38487 2.26695 -0.23362 2.03334
magnitude: 2.69216 au
magnitude: 6.84292 debye
